{"text_format":"1","workbook":"xlsx","n_sheets":63,"sheets":["Übersicht","Kommunikationsplan","Die Ebenen","Benchmark \"VereinsBest\"","VereinsBest-Diagramme","Benchmark \"Future Eleven\" ","B_Konzept","B_I_Entw_Konzept","B_I_A_VereinsPersp","B_I_A_A1_VP_Leitbild","B_I_A_A2_VP_Ziele","B_I_A_A3_VP_Strategie","B_I_A_A4_VP_Aktionsplan","B_I_B_AusBildungsPersp","B_I_B_B1_ABP_KnowHow_Funk","B_I_B_B2_ABP_VerwaltungsFunk","B_I_B_B3_ABP_SportFun","B_I_B_B4_ABP_VermarktungsFun","B_II_Verw_Konzept","B_II_C_VerwaltungsPersp","B_II_C_C1_VerwP_EffektveVerw","B_II_C_C2_Rahmenbe_f_Funktionär","B_II_C_C3_Infrastruktur Beteili","B_II_D FinanzPersp","B_II_D_D1_Unterstützer FinanzP","B_II_D_D2_Sport FinanzP","B_II_D_D3_Veranstaltung FinanzP","B_II_D_D4_Gastro FinanzP","B_III_Sport_Konzept","B_III_E Visions Persp","B_III_E_E1_SpP_V-Visionen","B_III_E_E2_SpP_Spielsys-Vision","B_III_E_E3_SpP_Vision KM","B_III_E_E4_SpP_Vision NW","B_III_F Sport Persp","B_III_F_F1_SpP_Vereinssportleit","B_III_F_F2_SpP_Spielsystem","B_III_F_F3_SpP_Spiel-Tr-Ausb KM","B_III_F_F4_SpP_Spiel-Tr-Ausb NW","B_III_G Sportumfeld Persp","B_III_G_G1_SpP_Sportumfeld","B_III_G_G2_SpP_Sportumfeld_2","B_IV_Vermarktungs_Konzept","B_IV_H Öffentlichkeitsarb Persp","B_IV_H_H1_Öffentliche Darst","B_IV_H_H2_Öffentlichkeits-PR","B_IV_H_H3_Kommunikation","B_IV_H_H4_Veranstaltung-Events","B_IV_H_H5_Benchmark Verm","B_IV_I Kommunikations Persp","B_IV_I_I1_Kommunikationsablauf","B_IV_I_I2_Komm-Medien Heute","B_IV_I_I3_Die \"5W\" der Komm","B_IV_I_I4_Komm Innen-Außen","B_IV_I_I5_Komm Pressearbeit","B_IV_J Marketing Persp","B_IV_J_J1_Marketingzyklus","B_IV_J_J2_Online-Content Market","B_IV_J_J3_Sponsoring","B_IV_J_J4_Sponsorenmappe","B_V_Nachhaltigkeits_Konzept","B_V_N_Nachhaltigkeitspersp","B_V_N_N1_Nachhaltigkeit"],"not_rendered":{"charts":13,"images":8,"macros":1,"external_links":0,"defined_names":58,"comments":0,"pivot_tables":0},"unopened":[],"bounds":{"document_bytes":16777216,"sheet_cells":100000,"rows_first":2000,"rows_last":500,"rows_between":2000,"halvings":0,"cell_chars":16384,"cell_head_chars":4096},"cells_cut":0,"cells_raw":0,"read":"whole","date_system":"1900"}

{"sheet":"Übersicht","index":0,"n_rows":52,"n_cols":4,"rows_kept":52,"cut":false,"hidden":false,"merged":[[21,3,21,5],[23,3,23,5],[9,3,9,5],[11,3,11,5],[1,0,1,9],[3,2,3,8],[5,2,5,8],[7,2,7,8],[19,2,19,8],[13,3,13,5],[15,3,15,5],[17,3,17,5],[25,2,25,8],[51,1,51,2],[43,1,43,8],[45,3,45,8],[46,3,46,8],[47,3,47,8],[48,3,48,8],[49,3,49,8],[50,3,50,8],[51,3,51,8],[45,1,45,2],[46,1,46,2],[47,1,47,2],[48,1,48,2],[49,1,49,2],[50,1,50,2]]}
[]
["STRATEGY Map Verein 4.0"]
[]
[null,null,"Plattform Verein 4.0"]
[]
[null,null,"Die Ebenen"]
[]
[null,null,"Konzepte"]
[]
[null,null,null,"1.) Entwicklungskonzept"]
[]
[null,null,null,"2.) Verwaltungskonzept"]
[]
[null,null,null,"3.) Sportkonzept"]
[]
[null,null,null,"4.) Vermarktungskonzept"]
[]
[null,null,null,"5.) Nachhaltigkeitskonzept"]
[]
[null,null,"Benchmarks"]
[]
[null,null,null,"Benchmark \"Future Eleven\" "]
[]
[null,null,null,"Benchmark \"VereinsBest\""]
[]
[null,null,"Kommunikationsplan"]
[]
[]
[]
[]
[]
[]
[]
[]
[]
[]
[]
[]
[]
[]
[]
[]
[]
[null,"Bewertung der Aktivitäten in den Tabellen (Richtwerte)"]
[]
[null,"-%",null,"Keine Aktivität; Keine Notwendigkeit; Kein Bedarf"]
[null,"1% - 10%",null,"Gedanken gemacht und im Vorstand (Intern) besprochen"]
[null,"11% - 25%",null,"Verschriftlicht und Zeitplan für Umsetzung erstellt"]
[null,"26% - 50%",null,"Begonnen ersten Schritt im Zeitplan umzusetzen"]
[null,"51% - 75%",null,"Laufende Umsetzung des Zeitplans (schriftlicher Nachweis)"]
[null,"76% - 90%",null,"Offizieller Start (Einführungsphase abgeschlossen)"]
[null,"91% - 100%",null,"Eingeführt und laufend evaluiert und angepasst"]

{"sheet":"Kommunikationsplan","index":1,"n_rows":6,"n_cols":16,"rows_kept":6,"cut":false,"hidden":false,"merged":[[1,1,1,5],[0,0,0,1],[1,8,1,9],[1,11,1,12],[0,14,1,15],[0,7,0,8],[3,5,3,15],[4,5,4,6],[4,7,4,8],[4,9,4,10],[4,11,4,12],[4,13,4,15]]}
["Kommunikationsplan",null,null,null,null,null,null,"Zeitraum:"]
["Verein:",{"$f":"B_Konzept!E1","v":"Union TTI St. Florian"},null,null,null,null,null,"von","2020-04-01",null,"bis","31.06.2020"]
[]
[null,null,null,null,null,"Kanal"]
[null,null,null,null,null,"Persönlich",null,"Drucksorten",null,"Medien",null,"Email",null,"Neue Medien"]
["Thema","Wer","Wann","An wenn","Kosten","1:1","1:N","Vereins-\nzeitung","Schaukasten\nPlakatständer","Presse","Fernsehen\nRadio","Newsletter","Aus-sendung","Website","Social Media","Youtube\nPodcast"]

{"sheet":"Die Ebenen","index":2,"n_rows":113,"n_cols":15,"rows_kept":113,"cut":false,"hidden":false,"merged":[[1,6,1,14],[0,0,0,1],[0,4,0,5],[0,2,0,3]]}
["Benchmark \"Future Eleven\" ",null,{"$f":"B_Konzept!E1","v":"Union TTI St. Florian"},null,"Benchmark \"VereinsBest\""]
["Ebene 0","Ebene 1","Ebene 2",null,"Ebene 3",null,"Ebene 4"]
[{"$f":"B_Konzept!$B$2","v":"Konzepte"},{"$f":"B_I_Entw_Konzept!$B$2","v":"I. Entwicklungskonzept"}]
[]
[{"$f":"B_Konzept!$B$2","v":"Konzepte"},{"$f":"B_I_Entw_Konzept!$B$2","v":"I. Entwicklungskonzept"},{"$f":"B_I_Entw_Konzept!$B$5","v":"A. Vereinsperspektive"}]
[]
[{"$f":"B_Konzept!$B$2","v":"Konzepte"},{"$f":"B_I_Entw_Konzept!$B$2","v":"I. Entwicklungskonzept"},{"$f":"B_I_Entw_Konzept!$B$5","v":"A. Vereinsperspektive"},1,{"$f":"B_I_A_A1_VP_Leitbild!B4","v":"A1. Vereinsleitbild"},"-",{"$f":"B_I_A_A1_VP_Leitbild!$B5","v":"Leitideen"},{"$f":"B_I_A_A1_VP_Leitbild!B6","v":"Sinn und Zweck"},{"$f":"B_I_A_A1_VP_Leitbild!B7","v":"Nutzen für Mitglieder und Gesellschaft"},{"$f":"B_I_A_A1_VP_Leitbild!B8","v":"Normen"},{"$f":"B_I_A_A1_VP_Leitbild!B9","v":"Werte"},{"$f":"B_I_A_A1_VP_Leitbild!B10","v":"Muster"},{"$f":"B_I_A_A1_VP_Leitbild!B11","v":"Mission"},{"$f":"B_I_A_A1_VP_Leitbild!B12","v":"Visionen"},{"$f":"B_I_A_A1_VP_Leitbild!B13","v":"Leitsätze"}]
[]
[{"$f":"B_Konzept!$B$2","v":"Konzepte"},{"$f":"B_I_Entw_Konzept!$B$2","v":"I. Entwicklungskonzept"},{"$f":"B_I_Entw_Konzept!$B$5","v":"A. Vereinsperspektive"},{"$f":"D7+1","v":2},{"$f":"B_I_A_A2_VP_Ziele!B4","v":"A2. Ziele"},"-",{"$f":"B_I_A_A2_VP_Ziele!$B5","v":"Sportliche Ziele"},{"$f":"B_I_A_A2_VP_Ziele!$B6","v":"Wirtschaftliche Ziele"},{"$f":"B_I_A_A2_VP_Ziele!$B7","v":"Gesellschaftliche Ziele"},{"$f":"B_I_A_A2_VP_Ziele!$B8","v":"A2_Ziele 4"},{"$f":"B_I_A_A2_VP_Ziele!$B9","v":"A2_Ziele 5"},{"$f":"B_I_A_A2_VP_Ziele!$B10","v":"A2_Ziele 6"},{"$f":"B_I_A_A2_VP_Ziele!$B11","v":"A2_Ziele 7"},{"$f":"B_I_A_A2_VP_Ziele!$B12","v":"A2_Ziele 8"},{"$f":"B_I_A_A2_VP_Ziele!$B13","v":"A2_Ziele 9"}]
[]
[{"$f":"B_Konzept!$B$2","v":"Konzepte"},{"$f":"B_I_Entw_Konzept!$B$2","v":"I. Entwicklungskonzept"},{"$f":"B_I_Entw_Konzept!$B$5","v":"A. Vereinsperspektive"},{"$f":"D9+1","v":3},{"$f":"B_I_A_A3_VP_Strategie!B4","v":"A3. Strategie"},"-",{"$f":"B_I_A_A3_VP_Strategie!B5","v":"BEnt1 - Vereinsstrategie"},{"$f":"B_I_A_A3_VP_Strategie!B6","v":"Wirtschaftliche Strategien"},{"$f":"B_I_A_A3_VP_Strategie!B7","v":"Gesellschaftliche Strategien"},{"$f":"B_I_A_A3_VP_Strategie!B8","v":"Sportliche Strategien"},{"$f":"B_I_A_A3_VP_Strategie!B9","v":"Nachwuchs Strategien"},{"$f":"B_I_A_A3_VP_Strategie!B10","v":"Veranstaltung"},{"$f":"B_I_A_A3_VP_Strategie!B11","v":"A3_Strategie 7"},{"$f":"B_I_A_A3_VP_Strategie!B12","v":"A3_Strategie 8"},{"$f":"B_I_A_A3_VP_Strategie!B13","v":"A3_Strategie 9"}]
[]
[{"$f":"B_Konzept!$B$2","v":"Konzepte"},{"$f":"B_I_Entw_Konzept!$B$2","v":"I. Entwicklungskonzept"},{"$f":"B_I_Entw_Konzept!$B$5","v":"A. Vereinsperspektive"},{"$f":"D11+1","v":4},{"$f":"B_I_A_A4_VP_Aktionsplan!B4","v":"A4. Aktionsplan"},"-",{"$f":"B_I_A_A4_VP_Aktionsplan!B5","v":"Sportliche Aktonsplan"},{"$f":"B_I_A_A4_VP_Aktionsplan!B6","v":"Wirtschaftliche Aktionsplan"},{"$f":"B_I_A_A4_VP_Aktionsplan!B7","v":"Gesellschaftliche Aktionsplan"},{"$f":"B_I_A_A4_VP_Aktionsplan!B8","v":"A4_Aktionsplan 4"},{"$f":"B_I_A_A4_VP_Aktionsplan!B9","v":"A4_Aktionsplan 5"},{"$f":"B_I_A_A4_VP_Aktionsplan!B10","v":"A4_Aktionsplan 6"},{"$f":"B_I_A_A4_VP_Aktionsplan!B11","v":"A4_Aktionsplan 7"},{"$f":"B_I_A_A4_VP_Aktionsplan!B12","v":"A4_Aktionsplan 8"},{"$f":"B_I_A_A4_VP_Aktionsplan!B13","v":"A4_Aktionsplan 9"}]
[]
[{"$f":"B_Konzept!$B$2","v":"Konzepte"},{"$f":"B_I_Entw_Konzept!$B$2","v":"I. Entwicklungskonzept"},{"$f":"B_I_Entw_Konzept!$B$6","v":"B. (Aus)Bildungsperspektive"}]
[]
[{"$f":"B_Konzept!$B$2","v":"Konzepte"},"I. Entwicklungskonzept","B. (Aus)Bildungsperspektive",{"$f":"D13+1","v":5},{"$f":"B_I_B_B1_ABP_KnowHow_Funk!B4","v":"B1. KnowHow der Funktionäre"},"-",{"$f":"B_I_B_B1_ABP_KnowHow_Funk!B5","v":"Kompetenzen Know How Fkt."},{"$f":"B_I_B_B1_ABP_KnowHow_Funk!B6","v":"Fachwissen Know How Fkt."},{"$f":"B_I_B_B1_ABP_KnowHow_Funk!B7","v":"Berufliche Fähigkeiten Fkt."},{"$f":"B_I_B_B1_ABP_KnowHow_Funk!B8","v":"Soziale Kompetenz Fkt."},{"$f":"B_I_B_B1_ABP_KnowHow_Funk!B9","v":"Weiterbildung Fkt."},{"$f":"B_I_B_B1_ABP_KnowHow_Funk!B10","v":"Standing in der Region Fkt."},{"$f":"B_I_B_B1_ABP_KnowHow_Funk!B11","v":"Zeitliche Ressourcen Fkt."},{"$f":"B_I_B_B1_ABP_KnowHow_Funk!B12","v":"Identifikation Fkt."},{"$f":"B_I_B_B1_ABP_KnowHow_Funk!B13","v":"Muster_1 Fkt."}]
[]
[{"$f":"B_Konzept!$B$2","v":"Konzepte"},{"$f":"B_I_Entw_Konzept!$B$2","v":"I. Entwicklungskonzept"},{"$f":"B_I_Entw_Konzept!$B$6","v":"B. (Aus)Bildungsperspektive"},{"$f":"D17+1","v":6},{"$f":"B_I_B_B2_ABP_VerwaltungsFunk!B4","v":"B2. Verwaltungs Funktionäre"},"-",{"$f":"B_I_B_B2_ABP_VerwaltungsFunk!B5","v":"Kompetenzen Verwaltungsfunktionär"},{"$f":"B_I_B_B2_ABP_VerwaltungsFunk!B6","v":"Fachwissen  Verwaltungsfunktionär"},{"$f":"B_I_B_B2_ABP_VerwaltungsFunk!B7","v":"Berufliche Fähigkeiten  Verw.Funktionär"},{"$f":"B_I_B_B2_ABP_VerwaltungsFunk!B8","v":"Soziale Kompetenz Verw_Fkt."},{"$f":"B_I_B_B2_ABP_VerwaltungsFunk!B9","v":"Weiterbildung Verw_Fkt."},{"$f":"B_I_B_B2_ABP_VerwaltungsFunk!B10","v":"Standing in der Region Verw_Fkt."},{"$f":"B_I_B_B2_ABP_VerwaltungsFunk!B11","v":"Zeitliche Ressourcen Verw_Fkt."},{"$f":"B_I_B_B2_ABP_VerwaltungsFunk!B12","v":"Identifikation Verw_Fkt."},{"$f":"B_I_B_B2_ABP_VerwaltungsFunk!B13","v":"Test-Muster_2 Verw_Fkt."}]
[]
[{"$f":"B_Konzept!$B$2","v":"Konzepte"},{"$f":"B_I_Entw_Konzept!$B$2","v":"I. Entwicklungskonzept"},{"$f":"B_I_Entw_Konzept!$B$6","v":"B. (Aus)Bildungsperspektive"},{"$f":"D19+1","v":7},{"$f":"B_I_B_B3_ABP_SportFun!B4","v":"B3. Sport Funktionäre"},"-",{"$f":"B_I_B_B3_ABP_SportFun!B5","v":"Kompetenzen Sportfunktionär"},{"$f":"B_I_B_B3_ABP_SportFun!B6","v":"Fachwissen Sportfunktionär"},{"$f":"B_I_B_B3_ABP_SportFun!B7","v":"Berufliche Fähigkeiten Sportfunktionär"},{"$f":"B_I_B_B3_ABP_SportFun!B8","v":"Soziale Kompetenz Sp_Fkt."},{"$f":"B_I_B_B3_ABP_SportFun!B9","v":"Weiterbildung Sp_Fkt."},{"$f":"B_I_B_B3_ABP_SportFun!B10","v":"Standing in der Region Sp_Fkt."},{"$f":"B_I_B_B3_ABP_SportFun!B11","v":"Zeitliche Ressourcen Sp_Fkt."},{"$f":"B_I_B_B3_ABP_SportFun!B12","v":"Identifikation Sp_Fkt."},{"$f":"B_I_B_B3_ABP_SportFun!B13","v":"Test-Muster_3 Sp_Fkt."}]
[]
[{"$f":"B_Konzept!$B$2","v":"Konzepte"},{"$f":"B_I_Entw_Konzept!$B$2","v":"I. Entwicklungskonzept"},{"$f":"B_I_Entw_Konzept!$B$6","v":"B. (Aus)Bildungsperspektive"},{"$f":"D21+1","v":8},{"$f":"B_I_B_B4_ABP_VermarktungsFun!B4","v":"B4. Vermarktungs Funktionäre"},"-",{"$f":"B_I_B_B4_ABP_VermarktungsFun!B5","v":"Kompetenzen Vermarktungsfunktionär"},{"$f":"B_I_B_B4_ABP_VermarktungsFun!B6","v":"Fachwissen Vermarktungsfunktionär"},{"$f":"B_I_B_B4_ABP_VermarktungsFun!B7","v":"Berufliche Fähigkeiten Verm.Funktionär"},{"$f":"B_I_B_B4_ABP_VermarktungsFun!B8","v":"Soziale Kompetenz  Vermarktungsfunktionär"},{"$f":"B_I_B_B4_ABP_VermarktungsFun!B9","v":"Weiterbildung Vermarktungsfunktionär"},{"$f":"B_I_B_B4_ABP_VermarktungsFun!B10","v":"Standing in der Region Verm_Fkt."},{"$f":"B_I_B_B4_ABP_VermarktungsFun!B11","v":"Zeitliche Ressourcen Verm_Fkt."},{"$f":"B_I_B_B4_ABP_VermarktungsFun!B12","v":"Identifikation Verm_Fkt."},{"$f":"B_I_B_B4_ABP_VermarktungsFun!B13","v":"Test Verm_Fkt."}]
[]
[{"$f":"B_Konzept!$B$2","v":"Konzepte"},{"$f":"B_II_Verw_Konzept!$B$2","v":"II. Verwaltungskonzept"}]
[]
[{"$f":"B_Konzept!$B$2","v":"Konzepte"},{"$f":"B_II_Verw_Konzept!$B$2","v":"II. Verwaltungskonzept"},{"$f":"B_II_Verw_Konzept!$B$5","v":"C. Verwaltungsperspektive"}]
[]
[{"$f":"B_Konzept!$B$2","v":"Konzepte"},{"$f":"B_II_Verw_Konzept!$B$2","v":"II. Verwaltungskonzept"},{"$f":"B_II_Verw_Konzept!$B$5","v":"C. Verwaltungsperspektive"},{"$f":"D23+1","v":9},{"$f":"B_II_C_C1_VerwP_EffektveVerw!B4","v":"C1. Effektive Verwaltung aufgebaut"},"-",{"$f":"B_II_Verw_Konzept!$L2","v":"Effektive Verwaltung_1"},{"$f":"B_II_Verw_Konzept!$L3","v":"Effektive Verwaltung_2"},{"$f":"B_II_Verw_Konzept!$L4","v":"Effektive Verwaltung_3"},{"$f":"B_II_Verw_Konzept!$L5","v":"Effektive Verwaltung_4"},{"$f":"B_II_Verw_Konzept!$L6","v":"Effektive Verwaltung_5"},{"$f":"B_II_Verw_Konzept!$L7","v":"Effektive Verwaltung_6"},{"$f":"B_II_Verw_Konzept!$L8","v":"Effektive Verwaltung_7"},{"$f":"B_II_Verw_Konzept!$L9","v":"Effektive Verwaltung_8"},{"$f":"B_II_Verw_Konzept!$L10","v":"Effektive Verwaltung_9"}]
[]
[{"$f":"B_Konzept!$B$2","v":"Konzepte"},{"$f":"B_II_Verw_Konzept!$B$2","v":"II. Verwaltungskonzept"},{"$f":"B_II_Verw_Konzept!$B$5","v":"C. Verwaltungsperspektive"},{"$f":"D29+1","v":10},{"$f":"B_II_C_C2_Rahmenbe_f_Funktionär!B4","v":"C2. Rahmenbedingung für Funktionäre"},"-",{"$f":"B_II_Verw_Konzept!$N2","v":"Rahmenbedingungen"},{"$f":"B_II_Verw_Konzept!$N3","v":"Rahmenbedingungen_2"},{"$f":"B_II_Verw_Konzept!$N4","v":"Rahmenbedingungen_3"},{"$f":"B_II_Verw_Konzept!$N5","v":"Rahmenbedingungen_4"},{"$f":"B_II_Verw_Konzept!$N6","v":"Rahmenbedingungen_5"},{"$f":"B_II_Verw_Konzept!$N7","v":"Rahmenbedingungen_6"},{"$f":"B_II_Verw_Konzept!$N8","v":"Rahmenbedingungen_7"},{"$f":"B_II_Verw_Konzept!$N9","v":"Rahmenbedingungen_8"},{"$f":"B_II_Verw_Konzept!$N10","v":"Rahmenbedingungen_9"}]
[]
[{"$f":"B_Konzept!$B$2","v":"Konzepte"},{"$f":"B_II_Verw_Konzept!$B$2","v":"II. Verwaltungskonzept"},{"$f":"B_II_Verw_Konzept!$B$5","v":"C. Verwaltungsperspektive"},{"$f":"D31+1","v":11},{"$f":"'B_II_C_C3_Infrastruktur Beteili'!B4","v":"C3. Infrastruktur für alle Beteiligten"},"-",{"$f":"B_II_Verw_Konzept!P2","v":"Strukturen"},{"$f":"B_II_Verw_Konzept!P3","v":"Infrastruktur_2"},{"$f":"B_II_Verw_Konzept!$P4","v":"Infrastruktur_3"},{"$f":"B_II_Verw_Konzept!$P5","v":"Infrastruktur_4"},{"$f":"B_II_Verw_Konzept!$P6","v":"Infrastruktur_5"},{"$f":"B_II_Verw_Konzept!$P7","v":"Infrastruktur_6"},{"$f":"B_II_Verw_Konzept!$P7","v":"Infrastruktur_6"},{"$f":"B_II_Verw_Konzept!$P9","v":"Infrastruktur_8"},{"$f":"B_II_Verw_Konzept!$P10","v":"Infrastruktur_9"}]
[]
[{"$f":"B_Konzept!$B$2","v":"Konzepte"},{"$f":"B_II_Verw_Konzept!$B$2","v":"II. Verwaltungskonzept"},{"$f":"B_II_Verw_Konzept!$B$6","v":"D. Finanzperspektive"}]
[]
[{"$f":"B_Konzept!$B$2","v":"Konzepte"},{"$f":"B_II_Verw_Konzept!$B$2","v":"II. Verwaltungskonzept"},{"$f":"B_II_Verw_Konzept!$B$6","v":"D. Finanzperspektive"},{"$f":"D33+1","v":12},{"$f":"'B_II_D_D1_Unterstützer FinanzP'!B4","v":"D1. Unterstützer des Vereins"},"-",{"$f":"B_II_Verw_Konzept!$L$13","v":"BVer1 - Sponsorenanteil am Budget steigt"},{"$f":"B_II_Verw_Konzept!$L$14","v":"BVer3 - Zahlungsüberschuss (Cash Flow) steigt"},{"$f":"B_II_Verw_Konzept!$L$15","v":"Mitgliedsbeiträge steigen"},{"$f":"B_II_Verw_Konzept!$L$16","v":"Subventionen Gemeinde"},{"$f":"B_II_Verw_Konzept!$L$17","v":"Sponsoren"},{"$f":"B_II_Verw_Konzept!$L$18","v":"Partnerschaften"},{"$f":"B_II_Verw_Konzept!$L$19","v":"Subventionen Verband/Land"},{"$f":"B_II_Verw_Konzept!$L$20","v":"Subventionen steigen"},{"$f":"B_II_Verw_Konzept!$L$21","v":"Unterstützer"}]
[]
[{"$f":"B_Konzept!$B$2","v":"Konzepte"},{"$f":"B_II_Verw_Konzept!$B$2","v":"II. Verwaltungskonzept"},{"$f":"B_II_Verw_Konzept!$B$6","v":"D. Finanzperspektive"},{"$f":"D37+1","v":13},{"$f":"'B_II_D_D2_Sport FinanzP'!B4","v":"D2. Sportlicher Bereich"},"-",{"$f":"B_II_Verw_Konzept!$N$13","v":"BVer2 - Spieltagsumsatz steigt"},{"$f":"B_II_Verw_Konzept!$N$14","v":"Transfererlöse steigen"},{"$f":"B_II_Verw_Konzept!$N$15","v":"Verkaufserlöse"},{"$f":"B_II_Verw_Konzept!$N$16","v":"Leihgebühren"},{"$f":"B_II_Verw_Konzept!$N$17","v":"Vermietungen"},{"$f":"B_II_Verw_Konzept!$N$18","v":"Spieltagssponsoring"},{"$f":"B_II_Verw_Konzept!$N$19","v":"Matchballsponsoring"},{"$f":"B_II_Verw_Konzept!$N$20","v":"Werbedurchsagen"},{"$f":"B_II_Verw_Konzept!$N$21","v":"Fanshop"}]
[]
[{"$f":"B_Konzept!$B$2","v":"Konzepte"},{"$f":"B_II_Verw_Konzept!$B$2","v":"II. Verwaltungskonzept"},{"$f":"B_II_Verw_Konzept!$B$6","v":"D. Finanzperspektive"},{"$f":"D39+1","v":14},{"$f":"'B_II_D_D3_Veranstaltung FinanzP'!B4","v":"D3. Veranstaltungen"},"-",{"$f":"B_II_Verw_Konzept!P13","v":"Höhere Gewinne bei Veranstaltungen"},{"$f":"B_II_Verw_Konzept!P14","v":"Sommerfeste"},{"$f":"B_II_Verw_Konzept!P15","v":"Winterveranstaltungen"},{"$f":"B_II_Verw_Konzept!P16","v":"Flohmarkt"},{"$f":"B_II_Verw_Konzept!P17","v":"Weihnachtsmarkt"},{"$f":"B_II_Verw_Konzept!P18","v":"Eisstockturnier"},{"$f":"B_II_Verw_Konzept!P19","v":"Faschingsumzug"},{"$f":"B_II_Verw_Konzept!P20","v":"Stadtfest"},{"$f":"B_II_Verw_Konzept!P21","v":"Veranstaltung_9"}]
[]
[{"$f":"B_Konzept!$B$2","v":"Konzepte"},{"$f":"B_II_Verw_Konzept!$B$2","v":"II. Verwaltungskonzept"},{"$f":"B_II_Verw_Konzept!$B$6","v":"D. Finanzperspektive"},{"$f":"D41+1","v":15},{"$f":"'B_II_D_D4_Gastro FinanzP'!B4","v":"D4. Gastronomie"},"-",{"$f":"B_II_Verw_Konzept!$R$13","v":"Buffet/Kantine"},{"$f":"B_II_Verw_Konzept!R14","v":"Tribüne"},{"$f":"B_II_Verw_Konzept!R15","v":"Hütten"},{"$f":"B_II_Verw_Konzept!R16","v":"Nachwuchshütte"},{"$f":"B_II_Verw_Konzept!R17","v":"Sonstige"},{"$f":"B_II_Verw_Konzept!R18","v":"Gastronomie_6"},{"$f":"B_II_Verw_Konzept!R19","v":"Gastronomie_7"},{"$f":"B_II_Verw_Konzept!R20","v":"Gastronomie_8"},{"$f":"B_II_Verw_Konzept!R21","v":"Gastronomie_9"}]
[]
[{"$f":"B_Konzept!$B$2","v":"Konzepte"},{"$f":"B_III_Sport_Konzept!$B$2","v":"III. Sportkonzept"}]
[]
[{"$f":"B_Konzept!$B$2","v":"Konzepte"},{"$f":"B_III_Sport_Konzept!$B$2","v":"III. Sportkonzept"},{"$f":"B_III_Sport_Konzept!$B$5","v":"E. Visionsperspektive"}]
[]
[{"$f":"B_Konzept!$B$2","v":"Konzepte"},{"$f":"B_III_Sport_Konzept!$B$2","v":"III. Sportkonzept"},{"$f":"B_III_Sport_Konzept!$B$5","v":"E. Visionsperspektive"},{"$f":"D43+1","v":16},{"$f":"'B_III_E Visions Persp'!B5","v":"E1. Vereinsvisionen"},"-",{"$f":"B_III_Sport_Konzept!L2","v":"Vereinsvision"},{"$f":"B_III_Sport_Konzept!L3","v":"Sportliche Vereinsvisionen"},{"$f":"B_III_Sport_Konzept!L4","v":"Tugenden/Motivation"},{"$f":"B_III_Sport_Konzept!L5","v":"Spielsystemvision"},{"$f":"B_III_Sport_Konzept!L6","v":"Scoutingvision"},{"$f":"B_III_Sport_Konzept!L7","v":"Analysevision"},{"$f":"B_III_Sport_Konzept!L8","v":"Therapievisionen"},{"$f":"B_III_Sport_Konzept!L9","v":"Medizinische Abteilung"},{"$f":"B_III_Sport_Konzept!L10","v":"Mentaltrainer"}]
[]
[{"$f":"B_Konzept!$B$2","v":"Konzepte"},{"$f":"B_III_Sport_Konzept!$B$2","v":"III. Sportkonzept"},{"$f":"B_III_Sport_Konzept!$B$5","v":"E. Visionsperspektive"},{"$f":"D49+1","v":17},{"$f":"'B_III_E Visions Persp'!B6","v":"E2. Spielsystemvisionen KM / NW"},"-",{"$f":"B_III_Sport_Konzept!N2","v":"Tugenden/Motivation"},{"$f":"B_III_Sport_Konzept!N3","v":"Spielsystemvision"},{"$f":"B_III_Sport_Konzept!N4","v":"Spielvision"},{"$f":"B_III_Sport_Konzept!N5","v":"Ausbildungsvision"},{"$f":"B_III_Sport_Konzept!N6","v":"Trainingsvision"},{"$f":"B_III_Sport_Konzept!N7","v":"Scoutingvision"},{"$f":"B_III_Sport_Konzept!N8","v":"Analysevision"},{"$f":"B_III_Sport_Konzept!N9","v":"Spielsystemvision_8"},{"$f":"B_III_Sport_Konzept!N10","v":"Spielsystemvision_9"}]
[]
[{"$f":"B_Konzept!$B$2","v":"Konzepte"},{"$f":"B_III_Sport_Konzept!$B$2","v":"III. Sportkonzept"},{"$f":"B_III_Sport_Konzept!$B$5","v":"E. Visionsperspektive"},{"$f":"D51+1","v":18},{"$f":"'B_III_E Visions Persp'!B7","v":"E3. Sport-Spielvisionen KM"},"-",{"$f":"B_III_Sport_Konzept!P2","v":"Tugenden/Motivation"},{"$f":"B_III_Sport_Konzept!P3","v":"Spielvision"},{"$f":"B_III_Sport_Konzept!P4","v":"Ausbildungsvision"},{"$f":"B_III_Sport_Konzept!P5","v":"Trainingsvision"},{"$f":"B_III_Sport_Konzept!P6","v":"Scoutingvision"},{"$f":"B_III_Sport_Konzept!P7","v":"Analysevision"},{"$f":"B_III_Sport_Konzept!P8","v":"Spieltaktische Visionen"},{"$f":"B_III_Sport_Konzept!P9","v":"Spielphasen Visionen"},{"$f":"B_III_Sport_Konzept!P10","v":"Sport-Spielvisionen KM_9"}]
[]
[{"$f":"B_Konzept!$B$2","v":"Konzepte"},{"$f":"B_III_Sport_Konzept!$B$2","v":"III. Sportkonzept"},{"$f":"B_III_Sport_Konzept!$B$5","v":"E. Visionsperspektive"},{"$f":"D53+1","v":19},{"$f":"'B_III_E Visions Persp'!B8","v":"E4. Sport-Spielvisionen NW"},"-",{"$f":"B_III_Sport_Konzept!R2","v":"Tugenden/Motivation"},{"$f":"B_III_Sport_Konzept!R3","v":"Spielvision"},{"$f":"B_III_Sport_Konzept!R4","v":"Ausbildungsvision"},{"$f":"B_III_Sport_Konzept!R5","v":"Trainingsvision"},{"$f":"B_III_Sport_Konzept!R6","v":"Scoutingvision"},{"$f":"B_III_Sport_Konzept!R7","v":"Analysevision"},{"$f":"B_III_Sport_Konzept!R8","v":"Spieltaktische Visionen"},{"$f":"B_III_Sport_Konzept!R9","v":"Spielphasen Visionen"},{"$f":"B_III_Sport_Konzept!R10","v":"Entwicklungsvisionen"}]
[]
[{"$f":"B_Konzept!$B$2","v":"Konzepte"},{"$f":"B_III_Sport_Konzept!$B$2","v":"III. Sportkonzept"},{"$f":"B_III_Sport_Konzept!$B$6","v":"F. Sportperspektive"}]
[]
[{"$f":"B_Konzept!$B$2","v":"Konzepte"},{"$f":"B_III_Sport_Konzept!$B$2","v":"III. Sportkonzept"},{"$f":"B_III_Sport_Konzept!$B$6","v":"F. Sportperspektive"},{"$f":"D55+1","v":20},{"$f":"'B_III_F Sport Persp'!B5","v":"F1. Vereinssportleitsätze"},"-",{"$f":"B_III_Sport_Konzept!L13","v":"BSpo1 - Ausbildungsstand der Trainer erhöhen"},{"$f":"B_III_Sport_Konzept!L14","v":"BSpo2 - Quantität der NW-Spieler wird erhöht"},{"$f":"B_III_Sport_Konzept!L15","v":"BSpo3 - Anteil der Eigenbauspieler in KM steigt"},{"$f":"B_III_Sport_Konzept!L16","v":"BSpo4 - Sportlicher Erfolg der KM steigt"},{"$f":"B_III_Sport_Konzept!L17","v":"Leitsätze"},{"$f":"B_III_Sport_Konzept!L18","v":"Qualität der NW wird erhöht"},{"$f":"B_III_Sport_Konzept!L19","v":"Qualität der KM Spieler wird erhöht"},{"$f":"B_III_Sport_Konzept!L20","v":"Interesse externer Spieler steigt"},{"$f":"B_III_Sport_Konzept!L21","v":"Passenden Trainer finden oder entwickeln"}]
[]
[{"$f":"B_Konzept!$B$2","v":"Konzepte"},{"$f":"B_III_Sport_Konzept!$B$2","v":"III. Sportkonzept"},{"$f":"B_III_Sport_Konzept!$B$6","v":"F. Sportperspektive"},{"$f":"D59+1","v":21},{"$f":"'B_III_F Sport Persp'!B6","v":"F2. Spielsystem-Auffassung KM/NW"},"-",{"$f":"B_III_Sport_Konzept!N13","v":"System-Auffassung"},{"$f":"B_III_Sport_Konzept!N14","v":"System-Auffassung_2"},{"$f":"B_III_Sport_Konzept!N15","v":"System-Auffassung_3"},{"$f":"B_III_Sport_Konzept!N16","v":"System-Auffassung_4"},{"$f":"B_III_Sport_Konzept!N17","v":"System-Auffassung_5"},{"$f":"B_III_Sport_Konzept!N18","v":"System-Auffassung_6"},{"$f":"B_III_Sport_Konzept!N19","v":"System-Auffassung_7"},{"$f":"B_III_Sport_Konzept!N20","v":"System-Auffassung_8"},{"$f":"B_III_Sport_Konzept!N21","v":"System-Auffassung_9"}]
[]
[{"$f":"B_Konzept!$B$2","v":"Konzepte"},{"$f":"B_III_Sport_Konzept!$B$2","v":"III. Sportkonzept"},{"$f":"B_III_Sport_Konzept!$B$6","v":"F. Sportperspektive"},{"$f":"D61+1","v":22},{"$f":"'B_III_F Sport Persp'!B7","v":"F3. Spiel-Trainings-Ausbildungsplan KM"},"-",{"$f":"B_III_Sport_Konzept!P13","v":"Spielplan"},{"$f":"B_III_Sport_Konzept!P14","v":"Ausbildungsplan"},{"$f":"B_III_Sport_Konzept!P15","v":"Trainingsplan"},{"$f":"B_III_Sport_Konzept!P16","v":"Rahmenbedingung für Trainer verbessern"},{"$f":"B_III_Sport_Konzept!P17","v":"Rahmenbedingung für Spieler verbessern"},{"$f":"B_III_Sport_Konzept!P18","v":"Spiel-Trainings-Ausbildungsplan KM_6"},{"$f":"B_III_Sport_Konzept!P19","v":"Spiel-Trainings-Ausbildungsplan KM_7"},{"$f":"B_III_Sport_Konzept!P20","v":"Spiel-Trainings-Ausbildungsplan KM_8"},{"$f":"B_III_Sport_Konzept!P21","v":"Spiel-Trainings-Ausbildungsplan KM_9"}]
[]
[{"$f":"B_Konzept!$B$2","v":"Konzepte"},{"$f":"B_III_Sport_Konzept!$B$2","v":"III. Sportkonzept"},{"$f":"B_III_Sport_Konzept!$B$6","v":"F. Sportperspektive"},{"$f":"D63+1","v":23},{"$f":"'B_III_F Sport Persp'!B8","v":"F4. Spiel-Trainings-Ausbildungsplan NW"},"-",{"$f":"B_III_Sport_Konzept!R13","v":"Trainingsplan"},{"$f":"B_III_Sport_Konzept!R14","v":"Ausbildungsplan"},{"$f":"B_III_Sport_Konzept!R15","v":"Spielplan"},{"$f":"B_III_Sport_Konzept!R16","v":"Rahmenbedingung für NW-Trainer verbessern"},{"$f":"B_III_Sport_Konzept!R17","v":"Rahmenbedingung für NW-Spieler verbessern"},{"$f":"B_III_Sport_Konzept!R18","v":"Spiel-Trainings-Ausbildungsplan NW_6"},{"$f":"B_III_Sport_Konzept!R19","v":"Spiel-Trainings-Ausbildungsplan NW_7"},{"$f":"B_III_Sport_Konzept!R20","v":"Spiel-Trainings-Ausbildungsplan NW_8"},{"$f":"B_III_Sport_Konzept!R21","v":"Spiel-Trainings-Ausbildungsplan NW_9"}]
[]
[{"$f":"B_Konzept!$B$2","v":"Konzepte"},{"$f":"B_III_Sport_Konzept!$B$2","v":"III. Sportkonzept"},{"$f":"B_III_Sport_Konzept!$B$7","v":"G. Sportumfeldperspektive"}]
[]
[{"$f":"B_Konzept!$B$2","v":"Konzepte"},{"$f":"B_III_Sport_Konzept!$B$2","v":"III. Sportkonzept"},{"$f":"B_III_Sport_Konzept!$B$7","v":"G. Sportumfeldperspektive"},{"$f":"D65+1","v":24},{"$f":"'B_III_G Sportumfeld Persp'!B5","v":"G1. Sportumfeld"},"-",{"$f":"B_III_Sport_Konzept!L24","v":"Sportumfeld-Test_1"},{"$f":"B_III_Sport_Konzept!L25","v":"Sportumfeld-Test_2"},{"$f":"B_III_Sport_Konzept!L26","v":"Sportumfeld-Test_3"},{"$f":"B_III_Sport_Konzept!L27","v":"Sportumfeld-Test_4"},{"$f":"B_III_Sport_Konzept!L28","v":"Sportumfeld-Test_5"},{"$f":"B_III_Sport_Konzept!L29","v":"Sportumfeld-Test_6"},{"$f":"B_III_Sport_Konzept!L30","v":"Sportumfeld-Test_7"},{"$f":"B_III_Sport_Konzept!L31","v":"Sportumfeld-Test_8"},{"$f":"B_III_Sport_Konzept!L32","v":"Sportumfeld-Test_9"}]
[]
[{"$f":"B_Konzept!$B$2","v":"Konzepte"},{"$f":"B_III_Sport_Konzept!$B$2","v":"III. Sportkonzept"},{"$f":"B_III_Sport_Konzept!$B$7","v":"G. Sportumfeldperspektive"},{"$f":"D69+1","v":25},{"$f":"'B_III_G Sportumfeld Persp'!B6","v":"G2. Sportumfeld_2"},"-",{"$f":"B_III_Sport_Konzept!N24","v":"Sportumfeld_2-Test_1"},{"$f":"B_III_Sport_Konzept!N25","v":"Sportumfeld_2-Test_2"},{"$f":"B_III_Sport_Konzept!N26","v":"Sportumfeld_2-Test_3"},{"$f":"B_III_Sport_Konzept!N27","v":"Sportumfeld_2-Test_4"},{"$f":"B_III_Sport_Konzept!N28","v":"Sportumfeld_2-Test_5"},{"$f":"B_III_Sport_Konzept!N29","v":"Sportumfeld_2-Test_6"},{"$f":"B_III_Sport_Konzept!N30","v":"Sportumfeld_2-Test_7"},{"$f":"B_III_Sport_Konzept!N31","v":"Sportumfeld_2-Test_8"},{"$f":"B_III_Sport_Konzept!N32","v":"Sportumfeld_2-Test_9"}]
[]
[{"$f":"B_Konzept!$B$2","v":"Konzepte"},{"$f":"B_IV_Vermarktungs_Konzept!$B$2","v":"IV. Vermarktungskonzept"}]
[]
[{"$f":"B_Konzept!$B$2","v":"Konzepte"},{"$f":"B_IV_Vermarktungs_Konzept!$B$2","v":"IV. Vermarktungskonzept"},{"$f":"B_IV_Vermarktungs_Konzept!$B$5","v":"H. Öffentlichkeitsperspektive"}]
[]
[{"$f":"B_Konzept!$B$2","v":"Konzepte"},{"$f":"B_IV_Vermarktungs_Konzept!$B$2","v":"IV. Vermarktungskonzept"},{"$f":"B_IV_Vermarktungs_Konzept!$B$5","v":"H. Öffentlichkeitsperspektive"},{"$f":"D71+1","v":26},{"$f":"'B_IV_H_H1_Öffentliche Darst'!B4","v":"H1. Öffentliche Darstellung"},"-",{"$f":"B_IV_Vermarktungs_Konzept!L2","v":"Grundstrategie"},{"$f":"B_IV_Vermarktungs_Konzept!L3","v":"Positionierung"},{"$f":"B_IV_Vermarktungs_Konzept!L4","v":"Darstellung nach Außen"},{"$f":"B_IV_Vermarktungs_Konzept!L5","v":"Selbstbild des Vereins"},{"$f":"B_IV_Vermarktungs_Konzept!L6","v":"Fremdbild des Vereins"},{"$f":"B_IV_Vermarktungs_Konzept!L7","v":"Werte"},{"$f":"B_IV_Vermarktungs_Konzept!L8","v":"Vereinsgelände"},{"$f":"B_IV_Vermarktungs_Konzept!L9","v":"Denkhaltungen"},{"$f":"B_IV_Vermarktungs_Konzept!L10","v":"Paradigmen"}]
[]
[{"$f":"B_Konzept!$B$2","v":"Konzepte"},{"$f":"B_IV_Vermarktungs_Konzept!$B$2","v":"IV. Vermarktungskonzept"},{"$f":"B_IV_Vermarktungs_Konzept!$B$5","v":"H. Öffentlichkeitsperspektive"},{"$f":"D77+1","v":27},{"$f":"'B_IV_H_H2_Öffentlichkeits-PR'!B4","v":"H2. Medien/Öffentlichkeitsarbeit"},"-",{"$f":"B_IV_Vermarktungs_Konzept!N2","v":"Vereinswebsite"},{"$f":"B_IV_Vermarktungs_Konzept!N3","v":"Verbandswebsite"},{"$f":"B_IV_Vermarktungs_Konzept!N4","v":"Soziale Medien"},{"$f":"B_IV_Vermarktungs_Konzept!N5","v":"Spieltaginformation"},{"$f":"B_IV_Vermarktungs_Konzept!N6","v":"E-Mail Informationen"},{"$f":"B_IV_Vermarktungs_Konzept!N7","v":"Printmedien"},{"$f":"B_IV_Vermarktungs_Konzept!N8","v":"Regional TV"},{"$f":"B_IV_Vermarktungs_Konzept!N9","v":"Platzsprecher"},{"$f":"B_IV_Vermarktungs_Konzept!N10","v":"Elternabende für NW Mannschaften"}]
[]
[{"$f":"B_Konzept!$B$2","v":"Konzepte"},{"$f":"B_IV_Vermarktungs_Konzept!$B$2","v":"IV. Vermarktungskonzept"},{"$f":"B_IV_Vermarktungs_Konzept!$B$5","v":"H. Öffentlichkeitsperspektive"},{"$f":"D79+1","v":28},{"$f":"B_IV_H_H3_Kommunikation!B4","v":"H3. Kommunikation"},"-",{"$f":"B_IV_Vermarktungs_Konzept!P2","v":"Kommunikation_1"},{"$f":"B_IV_Vermarktungs_Konzept!P3","v":"Kommunikation_2"},{"$f":"B_IV_Vermarktungs_Konzept!P4","v":"Kommunikation_3"},{"$f":"B_IV_Vermarktungs_Konzept!P5","v":"Kommunikation_4"},{"$f":"B_IV_Vermarktungs_Konzept!P6","v":"Kommunikation_5"},{"$f":"B_IV_Vermarktungs_Konzept!P7","v":"Kommunikation_6"},{"$f":"B_IV_Vermarktungs_Konzept!P8","v":"Kommunikation_7"},{"$f":"B_IV_Vermarktungs_Konzept!P9","v":"Kommunikation_8"},{"$f":"B_IV_Vermarktungs_Konzept!P10","v":"Kommunikation_9"}]
[]
[{"$f":"B_Konzept!$B$2","v":"Konzepte"},{"$f":"B_IV_Vermarktungs_Konzept!$B$2","v":"IV. Vermarktungskonzept"},{"$f":"B_IV_Vermarktungs_Konzept!$B$5","v":"H. Öffentlichkeitsperspektive"},{"$f":"D81+1","v":29},{"$f":"'B_IV_H_H4_Veranstaltung-Events'!B4","v":"H4. Veranstaltungen-Events"},"-",{"$f":"B_IV_Vermarktungs_Konzept!R2","v":"Musterevent_1"},{"$f":"B_IV_Vermarktungs_Konzept!R3","v":"Musterevent_2"},{"$f":"B_IV_Vermarktungs_Konzept!R4","v":"Musterevent_3"},{"$f":"B_IV_Vermarktungs_Konzept!R5","v":"Musterevent_4"},{"$f":"B_IV_Vermarktungs_Konzept!R6","v":"Musterevent_5"},{"$f":"B_IV_Vermarktungs_Konzept!R7","v":"Musterevent_6"},{"$f":"B_IV_Vermarktungs_Konzept!R8","v":"Musterevent_7"},{"$f":"B_IV_Vermarktungs_Konzept!R9","v":"Musterevent_8"},{"$f":"B_IV_Vermarktungs_Konzept!R10","v":"Musterevent_9"}]
[]
[{"$f":"B_Konzept!$B$2","v":"Konzepte"},{"$f":"B_IV_Vermarktungs_Konzept!$B$2","v":"IV. Vermarktungskonzept"},{"$f":"B_IV_Vermarktungs_Konzept!$B$5","v":"H. Öffentlichkeitsperspektive"},{"$f":"D83+1","v":30},{"$f":"'B_IV_H Öffentlichkeitsarb Persp'!B9","v":"H5. Benchmark BVerm"},"-",{"$f":"B_IV_Vermarktungs_Konzept!T2","v":"BMar1 - Mitgliederzahlen steigen"},{"$f":"B_IV_Vermarktungs_Konzept!T3","v":"BMar2 - Anteil Freiwilligenarbeit steigt"},{"$f":"B_IV_Vermarktungs_Konzept!T4","v":"BMar3 - Ausschöpfung Marketingkanäle"},{"$f":"B_IV_Vermarktungs_Konzept!T5","v":"Bessere Argumente für Subventionen"},{"$f":"B_IV_Vermarktungs_Konzept!T6","v":"Zuschauerzahlen steigen"},{"$f":"B_IV_Vermarktungs_Konzept!T7","v":"Soziale Anerkennung steigt"},{"$f":"B_IV_Vermarktungs_Konzept!T8","v":"Besserer Zugang zu (lokalen) Sponsoren"},{"$f":"B_IV_Vermarktungs_Konzept!T9","v":"Benchmark_8"},{"$f":"B_IV_Vermarktungs_Konzept!T10","v":"Benchmark_9"}]
[]
[{"$f":"B_Konzept!$B$2","v":"Konzepte"},{"$f":"B_IV_Vermarktungs_Konzept!$B$2","v":"IV. Vermarktungskonzept"},{"$f":"B_IV_Vermarktungs_Konzept!$B$6","v":"I. Kommunikationsperspektive"}]
[]
[{"$f":"B_Konzept!$B$2","v":"Konzepte"},{"$f":"B_IV_Vermarktungs_Konzept!$B$2","v":"IV. Vermarktungskonzept"},{"$f":"B_IV_Vermarktungs_Konzept!$B$6","v":"I. Kommunikationsperspektive"},{"$f":"D85+1","v":31},{"$f":"B_IV_I_I1_Kommunikationsablauf!B4","v":"I1. Kommunikationsablauf"},"-",{"$f":"B_IV_Vermarktungs_Konzept!L13","v":"Kommunikationsablauf_1"},{"$f":"B_IV_Vermarktungs_Konzept!L14","v":"Kommunikationsablauf_2"},{"$f":"B_IV_Vermarktungs_Konzept!L15","v":"Kommunikationsablauf_3"},{"$f":"B_IV_Vermarktungs_Konzept!L16","v":"Kommunikationsablauf_4"},{"$f":"B_IV_Vermarktungs_Konzept!L17","v":"Kommunikationsablauf_5"},{"$f":"B_IV_Vermarktungs_Konzept!L18","v":"Kommunikationsablauf_6"},{"$f":"B_IV_Vermarktungs_Konzept!L19","v":"Kommunikationsablauf_7"},{"$f":"B_IV_Vermarktungs_Konzept!L20","v":"Kommunikationsablauf_8"},{"$f":"B_IV_Vermarktungs_Konzept!L21","v":"Kommunikationsablauf_9"}]
[]
[{"$f":"B_Konzept!$B$2","v":"Konzepte"},{"$f":"B_IV_Vermarktungs_Konzept!$B$2","v":"IV. Vermarktungskonzept"},{"$f":"B_IV_Vermarktungs_Konzept!$B$6","v":"I. Kommunikationsperspektive"},{"$f":"D89+1","v":32},{"$f":"'B_IV_I_I2_Komm-Medien Heute'!B4","v":"I2. Kommunikation/Medien HEUTE"},"-",{"$f":"B_IV_Vermarktungs_Konzept!N13","v":"Kommunikation Heute"},{"$f":"B_IV_Vermarktungs_Konzept!N14","v":"Soziale Medien "},{"$f":"B_IV_Vermarktungs_Konzept!N15","v":"Kommunikation Heute_3"},{"$f":"B_IV_Vermarktungs_Konzept!N16","v":"Kommunikation Heute_4"},{"$f":"B_IV_Vermarktungs_Konzept!N17","v":"Kommunikation Heute_5"},{"$f":"B_IV_Vermarktungs_Konzept!N18","v":"Kommunikation Heute_6"},{"$f":"B_IV_Vermarktungs_Konzept!N19","v":"Kommunikation Heute_7"},{"$f":"B_IV_Vermarktungs_Konzept!N20","v":"Kommunikation Heute_8"},{"$f":"B_IV_Vermarktungs_Konzept!N21","v":"Kommunikation Heute_9"}]
[]
[{"$f":"B_Konzept!$B$2","v":"Konzepte"},{"$f":"B_IV_Vermarktungs_Konzept!$B$2","v":"IV. Vermarktungskonzept"},{"$f":"B_IV_Vermarktungs_Konzept!$B$6","v":"I. Kommunikationsperspektive"},{"$f":"D91+1","v":33},{"$f":"'B_IV_I_I3_Die \"5W\" der Komm'!B4","v":"I3. Die \"5W\" der Kommunikation"},"-",{"$f":"B_IV_Vermarktungs_Konzept!P13","v":"Was möchte ich mit Kom. erreichen"},{"$f":"B_IV_Vermarktungs_Konzept!P14","v":"Warum ist mir Kommunikation wichtig"},{"$f":"B_IV_Vermarktungs_Konzept!P15","v":"Wen möchte ich erreichen"},{"$f":"B_IV_Vermarktungs_Konzept!P16","v":"Wer ist meine Ziel-/Dialoggruppe"},{"$f":"B_IV_Vermarktungs_Konzept!P17","v":"Was ist der Neuigkeitswert"},{"$f":"B_IV_Vermarktungs_Konzept!P18","v":"Was ist anders, wenn wir gut kommunizieren"},{"$f":"B_IV_Vermarktungs_Konzept!P19","v":"leer"},{"$f":"B_IV_Vermarktungs_Konzept!P20","v":"leer"},{"$f":"B_IV_Vermarktungs_Konzept!P21","v":"leer"}]
[]
[{"$f":"B_Konzept!$B$2","v":"Konzepte"},{"$f":"B_IV_Vermarktungs_Konzept!$B$2","v":"IV. Vermarktungskonzept"},{"$f":"B_IV_Vermarktungs_Konzept!$B$6","v":"I. Kommunikationsperspektive"},{"$f":"D93+1","v":34},{"$f":"'B_IV_I_I4_Komm Innen-Außen'!B4","v":"I4. Kommunikation Innen/Außen"},"-",{"$f":"B_IV_Vermarktungs_Konzept!R13","v":"Kommunikation nach Innen"},{"$f":"B_IV_Vermarktungs_Konzept!R14","v":"Kommunikation nach Außen"},{"$f":"B_IV_Vermarktungs_Konzept!R15","v":"Kommunikation Innen/Außen_3"},{"$f":"B_IV_Vermarktungs_Konzept!R16","v":"Kommunikation Innen/Außen_4"},{"$f":"B_IV_Vermarktungs_Konzept!R17","v":"Kommunikation Innen/Außen_5"},{"$f":"B_IV_Vermarktungs_Konzept!R18","v":"Kommunikation Innen/Außen_6"},{"$f":"B_IV_Vermarktungs_Konzept!R19","v":"Kommunikation Innen/Außen_7"},{"$f":"B_IV_Vermarktungs_Konzept!R20","v":"Kommunikation Innen/Außen_8"},{"$f":"B_IV_Vermarktungs_Konzept!R21","v":"Kommunikation Innen/Außen_9"}]
[]
[{"$f":"B_Konzept!$B$2","v":"Konzepte"},{"$f":"B_IV_Vermarktungs_Konzept!$B$2","v":"IV. Vermarktungskonzept"},{"$f":"B_IV_Vermarktungs_Konzept!$B$6","v":"I. Kommunikationsperspektive"},{"$f":"D95+1","v":35},{"$f":"'B_IV_I_I5_Komm Pressearbeit'!B4","v":"I5. Pressearbeit"},"-",{"$f":"B_IV_Vermarktungs_Konzept!T13","v":"Pressearbeit_1"},{"$f":"B_IV_Vermarktungs_Konzept!T14","v":"Pressearbeit_2"},{"$f":"B_IV_Vermarktungs_Konzept!T15","v":"Pressearbeit_3"},{"$f":"B_IV_Vermarktungs_Konzept!T16","v":"Pressearbeit_4"},{"$f":"B_IV_Vermarktungs_Konzept!T17","v":"Pressearbeit_5"},{"$f":"B_IV_Vermarktungs_Konzept!T18","v":"Pressearbeit_6"},{"$f":"B_IV_Vermarktungs_Konzept!T19","v":"Pressearbeit_7"},{"$f":"B_IV_Vermarktungs_Konzept!T20","v":"Pressearbeit_8"},{"$f":"B_IV_Vermarktungs_Konzept!T21","v":"Pressearbeit_9"}]
[]
[{"$f":"B_Konzept!$B$2","v":"Konzepte"},{"$f":"B_IV_Vermarktungs_Konzept!$B$2","v":"IV. Vermarktungskonzept"},{"$f":"B_IV_Vermarktungs_Konzept!$B$7","v":"J. Marketingperspektive"}]
[]
[{"$f":"B_Konzept!$B$2","v":"Konzepte"},{"$f":"B_IV_Vermarktungs_Konzept!$B$2","v":"IV. Vermarktungskonzept"},{"$f":"B_IV_Vermarktungs_Konzept!$B$7","v":"J. Marketingperspektive"},{"$f":"D97+1","v":36},{"$f":"B_IV_J_J1_Marketingzyklus!B4","v":"J1. Marketingzyklus"},"-",{"$f":"B_IV_Vermarktungs_Konzept!L24","v":"Wo steht der Verein"},{"$f":"B_IV_Vermarktungs_Konzept!L25","v":"Wohin will der Verein"},{"$f":"B_IV_Vermarktungs_Konzept!L26","v":"Wie kommt man dort hin"},{"$f":"B_IV_Vermarktungs_Konzept!L27","v":"Welche Mittel stehen zur Verfügung"},{"$f":"B_IV_Vermarktungs_Konzept!L28","v":"Wie sieht der Plan/Konzept aus"},{"$f":"B_IV_Vermarktungs_Konzept!L29","v":"Umsetzung des Plans/Konzeptes"},{"$f":"B_IV_Vermarktungs_Konzept!L30","v":"Kontrollen während der Umsetzung"},{"$f":"B_IV_Vermarktungs_Konzept!L31","v":"Evaluierung am Ende des Zyklus"},{"$f":"B_IV_Vermarktungs_Konzept!L32","v":"Ergebnisse als Basis des nächsten Zyklus"}]
[]
[{"$f":"B_Konzept!$B$2","v":"Konzepte"},{"$f":"B_IV_Vermarktungs_Konzept!$B$2","v":"IV. Vermarktungskonzept"},{"$f":"B_IV_Vermarktungs_Konzept!$B$7","v":"J. Marketingperspektive"},{"$f":"D101+1","v":37},{"$f":"'B_IV_J_J2_Online-Content Market'!B4","v":"J2. Online/Content Marketing"},"-",{"$f":"B_IV_Vermarktungs_Konzept!N24","v":"Marketingabteilung vorhanden"},{"$f":"B_IV_Vermarktungs_Konzept!N25","v":"Online Marketing Maßnahmen aktuell"},{"$f":"B_IV_Vermarktungs_Konzept!N26","v":"Online Marketing Ziele"},{"$f":"B_IV_Vermarktungs_Konzept!N27","v":"Vereins(Marken)-Bekanntheit"},{"$f":"B_IV_Vermarktungs_Konzept!N28","v":"Außendarstellung, Werte vermitteln"},{"$f":"B_IV_Vermarktungs_Konzept!N29","v":"CM-Zielgruppe definieren"},{"$f":"B_IV_Vermarktungs_Konzept!N30","v":"CM-Leistungesangebot definieren"},{"$f":"B_IV_Vermarktungs_Konzept!N31","v":"CM- Evaluieren"},{"$f":"B_IV_Vermarktungs_Konzept!N32","v":"CM-Zielgruppe u. Angebot erweitern"}]
[]
[{"$f":"B_Konzept!$B$2","v":"Konzepte"},{"$f":"B_IV_Vermarktungs_Konzept!$B$2","v":"IV. Vermarktungskonzept"},{"$f":"B_IV_Vermarktungs_Konzept!$B$7","v":"J. Marketingperspektive"},{"$f":"D103+1","v":38},{"$f":"B_IV_J_J3_Sponsoring!B4","v":"J3. Sponsoring"},"-",{"$f":"B_IV_Vermarktungs_Konzept!P24","v":"SOLL/IST Vergleich"},{"$f":"B_IV_Vermarktungs_Konzept!P25","v":"Infrastruktur"},{"$f":"B_IV_Vermarktungs_Konzept!P26","v":"Verein allgemein"},{"$f":"B_IV_Vermarktungs_Konzept!P27","v":"Kleidung, Dressen, "},{"$f":"B_IV_Vermarktungs_Konzept!P28","v":"Spiel"},{"$f":"B_IV_Vermarktungs_Konzept!P29","v":"Heimspiel"},{"$f":"B_IV_Vermarktungs_Konzept!P30","v":"Werbedurchsagen"},{"$f":"B_IV_Vermarktungs_Konzept!P31","v":"Fernsehen, Kantine"},{"$f":"B_IV_Vermarktungs_Konzept!P32","v":"Soziale Medien (Website, Zeitungen, ...)"}]
[]
[{"$f":"B_Konzept!$B$2","v":"Konzepte"},{"$f":"B_IV_Vermarktungs_Konzept!$B$2","v":"IV. Vermarktungskonzept"},{"$f":"B_IV_Vermarktungs_Konzept!$B$7","v":"J. Marketingperspektive"},{"$f":"D105+1","v":39},{"$f":"B_IV_J_J4_Sponsorenmappe!B4","v":"J4. Sponsorenmappe"},"-",{"$f":"B_IV_Vermarktungs_Konzept!R24","v":"Sponsorenmappe bereits vorhanden"},{"$f":"B_IV_Vermarktungs_Konzept!R25","v":"Grundkonzept erstellt"},{"$f":"B_IV_Vermarktungs_Konzept!R26","v":"Vereinspräsentation"},{"$f":"B_IV_Vermarktungs_Konzept!R27","v":"Erwachsenenfußball Sponsorkonzept"},{"$f":"B_IV_Vermarktungs_Konzept!R28","v":"Nachwuchsfußball Sponsorenkonzept"},{"$f":"B_IV_Vermarktungs_Konzept!R29","v":"Sponsorvarianten, Visionen, Ziele"},{"$f":"B_IV_Vermarktungs_Konzept!R30","v":"Sponsorendatenliste vorhanden"},{"$f":"B_IV_Vermarktungs_Konzept!R31","v":"Schriftliche Verträge"},{"$f":"B_IV_Vermarktungs_Konzept!R32","v":"Jährliche Bepreisung in Zusatzblatt"}]
[]
[{"$f":"B_Konzept!$B$2","v":"Konzepte"},{"$f":"B_V_Nachhaltigkeits_Konzept!$B$2","v":"V. Nachhaltigkeitskonzept"}]
[]
[{"$f":"B_Konzept!$B$2","v":"Konzepte"},{"$f":"B_V_Nachhaltigkeits_Konzept!$B$2","v":"V. Nachhaltigkeitskonzept"},{"$f":"B_V_Nachhaltigkeits_Konzept!$B$5","v":"N. Nachhaltigkeitsperspektive"}]
[]
[{"$f":"B_Konzept!$B$2","v":"Konzepte"},{"$f":"B_V_Nachhaltigkeits_Konzept!$B$2","v":"V. Nachhaltigkeitskonzept"},{"$f":"B_V_Nachhaltigkeits_Konzept!$B$5","v":"N. Nachhaltigkeitsperspektive"},{"$f":"D107+1","v":40},{"$f":"B_V_N_N1_Nachhaltigkeit!B4","v":"N1. Nachhaltigkeit"},"-",{"$f":"B_V_Nachhaltigkeits_Konzept!L2","v":"Strom - Test für Strategy Map"},{"$f":"B_V_Nachhaltigkeits_Konzept!L3","v":"Wasser"},{"$f":"B_V_Nachhaltigkeits_Konzept!L4","v":"Gastronomie"},{"$f":"B_V_Nachhaltigkeits_Konzept!L5","v":"Rasen"},{"$f":"B_V_Nachhaltigkeits_Konzept!L6","v":"Vereinsgelände"},{"$f":"B_V_Nachhaltigkeits_Konzept!L7","v":"Veranstaltungen"},{"$f":"B_V_Nachhaltigkeits_Konzept!L8","v":"Gebäude"},{"$f":"B_V_Nachhaltigkeits_Konzept!L9","v":"Verwaltung"},{"$f":"B_V_Nachhaltigkeits_Konzept!L10","v":"Test"}]

{"sheet":"Benchmark \"VereinsBest\"","index":3,"n_rows":522,"n_cols":8,"rows_kept":522,"cut":false,"hidden":true,"merged":[[1,3,1,4],[0,3,0,4],[0,0,2,1],[3,0,3,3],[28,0,28,3],[53,0,53,3],[84,0,84,3],[2,3,2,4],[131,0,136,0],[4,0,27,0],[29,0,52,0],[54,0,83,0],[85,0,129,0],[130,0,130,3]]}
["Benchmark \n\"VereinsBest\"",null,"I. Entwicklungskonzept","IV. Vermarktungskonzept"]
[null,null,"II. Verwaltungskonzept","V. Nachhaltigkeitskonzept"]
[null,null,"III. Sportkonzept"]
[{"$f":"B_Konzept!B5","v":"I. Entwicklungskonzept"},null,null,null,"Notiz"]
[{"$f":"A4","v":"I. Entwicklungskonzept"},{"$f":"IF(C5<>\"\",B$143,\"\")","v":"A. Vereinsperspektive"},"Nutzen für Mitglieder und Gesellschaft",{"$f":"_xlfn.XLOOKUP(C5,$C$143:$C$178,$D$143:$D$178)","v":"-"}]
[null,null,"Visionen",{"$f":"_xlfn.XLOOKUP(C6,$C$143:$C$178,$D$143:$D$178)","v":"-"}]
[null,null,"Leitideen","-"]
[null,null,"Normen","-"]
[null,null,"Muster","-"]
[null,null,"Leitideen","-"]
[null,null,"Leitsätze","-"]
[null,null,"A2_Ziele 7","-"]
[null,null,"Wirtschaftliche Strategien","-"]
[null,null,"A4_Aktionsplan 9","-"]
[null,null,"A3_Strategie 9","-"]
[null,null,"A4_Aktionsplan 7","-"]
[null,{"$f":"IF(C17<>\"\",B$181,\"\")","v":"B. (Aus)Bildungsperspektive"},"Kompetenzen Know How Fkt.",{"$f":"_xlfn.XLOOKUP(C17,$C$181:$C$216,$D$181:$D$216)","v":"-"}]
[null,null,"Soziale Kompetenz Fkt.","-"]
[null,null,"Fachwissen Know How Fkt.","-"]
[null,null,"Weiterbildung Verw_Fkt.","-"]
[null,null,"Weiterbildung Sp_Fkt.","-"]
[null,null,"Zeitliche Ressourcen Verm_Fkt.","-"]
[null,null,"Test Verm_Fkt.","-"]
[null,null,"Test-Muster_3 Sp_Fkt.","-"]
[null,null,"Weiterbildung Vermarktungsfunktionär","-"]
[null,null,"Identifikation Sp_Fkt.","-"]
[null,null,"Kompetenzen Vermarktungsfunktionär","-"]
[null,null,"Standing in der Region Verm_Fkt.","-"]
[{"$f":"B_Konzept!B6","v":"II. Verwaltungskonzept"},null,null,null,"Notiz"]
[{"$f":"$A$29","v":"II. Verwaltungskonzept"},{"$f":"IF(C30<>\"\",B219,\"\")","v":"C. Verwaltungsperspektive"},"Effektive Verwaltung_1",{"$f":"_xlfn.XLOOKUP(C30,$C$219:$C$245,$D$219:$D$245)","v":"-"}]
[null,null,"Effektive Verwaltung_6","-"]
[null,null,"Effektive Verwaltung_7","-"]
[null,null,"Rahmenbedingungen_9","-"]
[null,null,"Rahmenbedingungen_5","-"]
[null,null,"Rahmenbedingungen_7","-"]
[null,null,"Rahmenbedingungen","-"]
[null,null,"Strukturen","-"]
[null,null,"Infrastruktur_2","-"]
[null,null,"Infrastruktur_3","-"]
[null," ","Infrastruktur_4","-"]
[null," ","Infrastruktur_8","-"]
[null,{"$f":"IF(C42<>\"\",B248,\"\")","v":"D. Finanzperspektive"},"BVer1 - Sponsorenanteil am Budget steigt",{"$f":"_xlfn.XLOOKUP(C42,$C$248:$C$283,$D$248:$D$283)","v":"-"}]
[null,null,"BVer3 - Zahlungsüberschuss (Cash Flow) steigt","-"]
[null,null,"BVer2 - Spieltagsumsatz steigt","-"]
[null,null,"Subventionen Verband/Land","-"]
[null,null,"Transfererlöse steigen","-"]
[null,null,"Fanshop","-"]
[null,null,"Weihnachtsmarkt","-"]
[null,null,"Subventionen Gemeinde","-"]
[null,null,"Hütten","-"]
[null,null,"Sonstige","-"]
[null,null,"Sponsoren","-"]
[null,null,"Partnerschaften","-"]
[{"$f":"B_Konzept!B7","v":"III. Sportkonzept"},null,null,null,"Notiz"]
[{"$f":"A54","v":"III. Sportkonzept"},{"$f":"IF(C55<>\"\",B286,\"\")","v":"E. Visionsperspektive"},"Sportliche Vereinsvisionen",{"$f":"_xlfn.XLOOKUP(C55,$C$286:$C$321,$D$286:$D$321)","v":"-"}]
[null,null,"Spielvision","-"]
[null,null,"Scoutingvision","-"]
[null,null,"Ausbildungsvision","-"]
[null,null,"Tugenden/Motivation","-"]
[null,null,"Sport-Spielvisionen KM_9","-"]
[null,null,"Spielsystemvision","-"]
[null,null,"Spieltaktische Visionen","-"]
[null,null,"Trainingsvision","-"]
[null,null,"Spielsystemvision_9","-"]
[null,null,"Entwicklungsvisionen","-"]
[null,null,"Analysevision","-"]
[null,{"$f":"IF(C67<>\"\",B324,\"\")","v":"F. Sportperspektive"},"BSpo1 - Ausbildungsstand der Trainer erhöhen",{"$f":"_xlfn.XLOOKUP(C67,$C$324:$C$359,$D$324:$D$359)","v":"-"}]
[null,null,"BSpo2 - Quantität der NW-Spieler wird erhöht","-"]
[null,null,"BSpo3 - Anteil der Eigenbauspieler in KM steigt","-"]
[null,null,"BSpo4 - Sportlicher Erfolg der KM steigt","-"]
[null,null,"System-Auffassung","-"]
[null,null,"Rahmenbedingung für NW-Trainer verbessern","-"]
[null,null,"Spielplan","-"]
[null,null,"Spiel-Trainings-Ausbildungsplan KM_9","-"]
[null,null,"Spiel-Trainings-Ausbildungsplan NW_9","-"]
[null,null,"Interesse externer Spieler steigt","-"]
[null,null,"Qualität der NW wird erhöht","-"]
[null,null,"Leitsätze","-"]
[null,{"$f":"IF(C79<>\"\",B362,\"\")","v":"G. Sportumfeldperspektive"},"Sportumfeld-Test_9",{"$f":"_xlfn.XLOOKUP(C79,$C$362:$C$379,$D$362:$D$379)","v":"-"}]
[null,null,"Sportumfeld-Test_6","-"]
[null,null,"Sportumfeld-Test_7","-"]
[null,null,"Sportumfeld_2-Test_1","-"]
[null,null,"Sportumfeld_2-Test_3","-"]
[null,null,"Sportumfeld_2-Test_9","-"]
[{"$f":"B_Konzept!B8","v":"IV. Vermarktungskonzept"},null,null,null,"Notiz"]
[{"$f":"A85","v":"IV. Vermarktungskonzept"},{"$f":"IF(C86<>\"\",B382,\"\")","v":"H. Öffentlichkeitsperspektive"},"Grundstrategie",{"$f":"_xlfn.XLOOKUP(C86,$C$382:$C$426,$D$382:$D$426)","v":"-"}]
[null,null,"Paradigmen","-"]
[null,null,"Elternabende für NW Mannschaften","-"]
[null,null,"Bessere Argumente für Subventionen","-"]
[null,null,"Werte","-"]
[null,null,"Zuschauerzahlen steigen","-"]
[null,null,"Soziale Medien","-"]
[null,null,"Darstellung nach Außen","-"]
[null,null,"Positionierung","-"]
[null,null,"Musterevent_3","-"]
[null,null,"Kommunikation_5","-"]
[null,null,"Besserer Zugang zu (lokalen) Sponsoren","-"]
[null,null,"BMar2 - Anteil Freiwilligenarbeit steigt","-"]
[null,null,"BMar1 - Mitgliederzahlern steigen",{"$error":"#N/A"}]
[null,null,"BMar3 - Ausschöpfung Marketingkanäle","-"]
[null,{"$f":"IF(C101<>\"\",B429,\"\")","v":"I. Kommunikationsperspektive"},"Kommunikationsablauf_1",{"$f":"_xlfn.XLOOKUP(C101,$C$429:$C$473,$D$429:$D$473)","v":"-"}]
[null,null,"Kommunikationsablauf_6","-"]
[null,null,"Kommunikation Heute","-"]
[null,null,"Was möchte ich mit Kom. erreichen","-"]
[null,null,"Pressearbeit_6","-"]
[null,null,"Was ist der Neuigkeitswert","-"]
[null,null,"Pressearbeit_8","-"]
[null,null,"Kommunikation nach Außen","-"]
[null,null,"Soziale Medien ","-"]
[null,null,"Wer ist meine Ziel-/Dialoggruppe","-"]
[null,null,"Pressearbeit_1","-"]
[null,null,"Warum ist mir Kommunikation wichtig","-"]
[null,null,"Kommunikation Innen/Außen_5","-"]
[null,null,"Kommunikation Heute_9","-"]
[null,null,"Kommunikation nach Innen","-"]
[null,{"$f":"IF(C116<>\"\",B476,\"\")","v":"J. Marketingperspektive"},"Wo steht der Verein",{"$f":"_xlfn.XLOOKUP(C116,$C$476:$C$511,$D$476:$D$511)","v":"-"}]
[null,null,"Umsetzung des Plans/Konzeptes","-"]
[null,null,"Kontrollen während der Umsetzung","-"]
[null,null,"Fernsehen, Kantine","-"]
[null,null,"CM-Zielgruppe definieren","-"]
[null,null,"Grundkonzept erstellt","-"]
[null,null,"SOLL/IST Vergleich","-"]
[null,null,"Verein allgemein","-"]
[null,null,"Werbedurchsagen","-"]
[null,null,"Heimspiel","-"]
[null,null,"Erwachsenenfußball Sponsorkonzept","-"]
[null,null,"Nachwuchsfußball Sponsorenkonzept","-"]
[null,null,"Ergebnisse als Basis des nächsten Zyklus","-"]
[null,null,"Jährliche Bepreisung in Zusatzblatt","-"]
[null,null,"Sponsorvarianten, Visionen, Ziele","-"]
[{"$f":"B_Konzept!B9","v":"V. Nachhaltigkeitskonzept"},null,null,null,"Notiz"]
[{"$f":"A131","v":"V. Nachhaltigkeitskonzept"},{"$f":"IF(C132<>\"\",B514,\"\")","v":"N. Nachhaltigkeitsperspektive"},"Strom - Test für Strategy Map",{"$f":"_xlfn.XLOOKUP(C132,$C$514:$C$522,$D$514:$D$522)","v":"-"}]
[null,null,"Gastronomie","-"]
[null,null,"Veranstaltungen","-"]
[null,null,"Rasen","-"]
[null,null,"Wasser","-"]
[null,null,"Gebäude","-"]
[]
[]
[]
[]
["L_Nr.","I. Entwicklungskonzept","I-A_Funktionen","I-A_Werte","I-A_100%","I-A_Funktion","I-A_Zeile","I-A_noch möglich"]
[1,{"$f":"B_I_A_VereinsPersp!$B$4","v":"A. Vereinsperspektive"},{"$f":"B_I_Entw_Konzept!L2","v":"Leitideen"},{"$f":"B_I_Entw_Konzept!M2","v":"-"},null,{"$f":"Tab_IA_VereinsPers[[#This Row],[I-A_Funktionen]]","v":"Leitideen"},{"$f":"IF(COUNTIF($C$5:$C$16,F143)>=1,\"\",ROW())","v":""},{"$f":"IF(ROW(C143)-ROW(C$143)+1>COUNT(Tab_IA_VereinsPers[I-A_Zeile]),\"\",INDEX(F:F,SMALL(Tab_IA_VereinsPers[I-A_Zeile],1+ROW(F143)-ROW($F$143))))","v":"Sinn und Zweck"}]
[2,null,{"$f":"B_I_Entw_Konzept!L3","v":"Sinn und Zweck"},{"$f":"B_I_Entw_Konzept!M3","v":"-"},null,{"$f":"Tab_IA_VereinsPers[[#This Row],[I-A_Funktionen]]","v":"Sinn und Zweck"},{"$f":"IF(COUNTIF($C$5:$C$16,F144)>=1,\"\",ROW())","v":144},{"$f":"IF(ROW(C144)-ROW(C$143)+1>COUNT(Tab_IA_VereinsPers[I-A_Zeile]),\"\",INDEX(F:F,SMALL(Tab_IA_VereinsPers[I-A_Zeile],1+ROW(F144)-ROW($F$143))))","v":"Werte"}]
[3,null,{"$f":"B_I_Entw_Konzept!L4","v":"Nutzen für Mitglieder und Gesellschaft"},{"$f":"B_I_Entw_Konzept!M4","v":"-"},null,{"$f":"Tab_IA_VereinsPers[[#This Row],[I-A_Funktionen]]","v":"Nutzen für Mitglieder und Gesellschaft"},{"$f":"IF(COUNTIF($C$5:$C$16,F145)>=1,\"\",ROW())","v":""},{"$f":"IF(ROW(C145)-ROW(C$143)+1>COUNT(Tab_IA_VereinsPers[I-A_Zeile]),\"\",INDEX(F:F,SMALL(Tab_IA_VereinsPers[I-A_Zeile],1+ROW(F145)-ROW($F$143))))","v":"Mission"}]
[4,null,{"$f":"B_I_Entw_Konzept!L5","v":"Normen"},{"$f":"B_I_Entw_Konzept!M5","v":"-"},null,{"$f":"Tab_IA_VereinsPers[[#This Row],[I-A_Funktionen]]","v":"Normen"},"",{"$f":"IF(ROW(C146)-ROW(C$143)+1>COUNT(Tab_IA_VereinsPers[I-A_Zeile]),\"\",INDEX(F:F,SMALL(Tab_IA_VereinsPers[I-A_Zeile],1+ROW(F146)-ROW($F$143))))","v":"Sportliche Ziele"}]
[5,null,{"$f":"B_I_Entw_Konzept!L6","v":"Werte"},{"$f":"B_I_Entw_Konzept!M6","v":"-"},null,{"$f":"Tab_IA_VereinsPers[[#This Row],[I-A_Funktionen]]","v":"Werte"},147,{"$f":"IF(ROW(C147)-ROW(C$143)+1>COUNT(Tab_IA_VereinsPers[I-A_Zeile]),\"\",INDEX(F:F,SMALL(Tab_IA_VereinsPers[I-A_Zeile],1+ROW(F147)-ROW($F$143))))","v":"Wirtschaftliche Ziele"}]
[6,null,{"$f":"B_I_Entw_Konzept!L7","v":"Muster"},{"$f":"B_I_Entw_Konzept!M7","v":"-"},null,{"$f":"Tab_IA_VereinsPers[[#This Row],[I-A_Funktionen]]","v":"Muster"},"",{"$f":"IF(ROW(C148)-ROW(C$143)+1>COUNT(Tab_IA_VereinsPers[I-A_Zeile]),\"\",INDEX(F:F,SMALL(Tab_IA_VereinsPers[I-A_Zeile],1+ROW(F148)-ROW($F$143))))","v":"Gesellschaftliche Ziele"}]
[7,null,{"$f":"B_I_Entw_Konzept!L8","v":"Mission"},{"$f":"B_I_Entw_Konzept!M8","v":"-"},null,{"$f":"Tab_IA_VereinsPers[[#This Row],[I-A_Funktionen]]","v":"Mission"},149,{"$f":"IF(ROW(C149)-ROW(C$143)+1>COUNT(Tab_IA_VereinsPers[I-A_Zeile]),\"\",INDEX(F:F,SMALL(Tab_IA_VereinsPers[I-A_Zeile],1+ROW(F149)-ROW($F$143))))","v":"A2_Ziele 4"}]
[8,null,{"$f":"B_I_Entw_Konzept!L9","v":"Visionen"},{"$f":"B_I_Entw_Konzept!M9","v":"-"},null,{"$f":"Tab_IA_VereinsPers[[#This Row],[I-A_Funktionen]]","v":"Visionen"},"",{"$f":"IF(ROW(C150)-ROW(C$143)+1>COUNT(Tab_IA_VereinsPers[I-A_Zeile]),\"\",INDEX(F:F,SMALL(Tab_IA_VereinsPers[I-A_Zeile],1+ROW(F150)-ROW($F$143))))","v":"A2_Ziele 5"}]
[9,null,{"$f":"B_I_Entw_Konzept!L10","v":"Leitsätze"},{"$f":"B_I_Entw_Konzept!M10","v":"-"},null,{"$f":"Tab_IA_VereinsPers[[#This Row],[I-A_Funktionen]]","v":"Leitsätze"},"",{"$f":"IF(ROW(C151)-ROW(C$143)+1>COUNT(Tab_IA_VereinsPers[I-A_Zeile]),\"\",INDEX(F:F,SMALL(Tab_IA_VereinsPers[I-A_Zeile],1+ROW(F151)-ROW($F$143))))","v":"A2_Ziele 6"}]
[10,null,{"$f":"B_I_Entw_Konzept!N2","v":"Sportliche Ziele"},{"$f":"B_I_Entw_Konzept!O2","v":"-"},null,{"$f":"Tab_IA_VereinsPers[[#This Row],[I-A_Funktionen]]","v":"Sportliche Ziele"},152,{"$f":"IF(ROW(C152)-ROW(C$143)+1>COUNT(Tab_IA_VereinsPers[I-A_Zeile]),\"\",INDEX(F:F,SMALL(Tab_IA_VereinsPers[I-A_Zeile],1+ROW(F152)-ROW($F$143))))","v":"A2_Ziele 8"}]
[11,null,{"$f":"B_I_Entw_Konzept!N3","v":"Wirtschaftliche Ziele"},{"$f":"B_I_Entw_Konzept!O3","v":"-"},null,{"$f":"Tab_IA_VereinsPers[[#This Row],[I-A_Funktionen]]","v":"Wirtschaftliche Ziele"},153,{"$f":"IF(ROW(C153)-ROW(C$143)+1>COUNT(Tab_IA_VereinsPers[I-A_Zeile]),\"\",INDEX(F:F,SMALL(Tab_IA_VereinsPers[I-A_Zeile],1+ROW(F153)-ROW($F$143))))","v":"A2_Ziele 9"}]
[12,null,{"$f":"B_I_Entw_Konzept!N4","v":"Gesellschaftliche Ziele"},{"$f":"B_I_Entw_Konzept!O4","v":"-"},null,{"$f":"Tab_IA_VereinsPers[[#This Row],[I-A_Funktionen]]","v":"Gesellschaftliche Ziele"},154,{"$f":"IF(ROW(C154)-ROW(C$143)+1>COUNT(Tab_IA_VereinsPers[I-A_Zeile]),\"\",INDEX(F:F,SMALL(Tab_IA_VereinsPers[I-A_Zeile],1+ROW(F154)-ROW($F$143))))","v":"BEnt1 - Vereinsstrategie"}]
[13,null,{"$f":"B_I_Entw_Konzept!N5","v":"A2_Ziele 4"},{"$f":"B_I_Entw_Konzept!O5","v":"-"},null,{"$f":"Tab_IA_VereinsPers[[#This Row],[I-A_Funktionen]]","v":"A2_Ziele 4"},155,{"$f":"IF(ROW(C155)-ROW(C$143)+1>COUNT(Tab_IA_VereinsPers[I-A_Zeile]),\"\",INDEX(F:F,SMALL(Tab_IA_VereinsPers[I-A_Zeile],1+ROW(F155)-ROW($F$143))))","v":"Gesellschaftliche Strategien"}]
[14,null,{"$f":"B_I_Entw_Konzept!N6","v":"A2_Ziele 5"},{"$f":"B_I_Entw_Konzept!O6","v":"-"},null,{"$f":"Tab_IA_VereinsPers[[#This Row],[I-A_Funktionen]]","v":"A2_Ziele 5"},156,{"$f":"IF(ROW(C156)-ROW(C$143)+1>COUNT(Tab_IA_VereinsPers[I-A_Zeile]),\"\",INDEX(F:F,SMALL(Tab_IA_VereinsPers[I-A_Zeile],1+ROW(F156)-ROW($F$143))))","v":"Sportliche Strategien"}]
[15,null,{"$f":"B_I_Entw_Konzept!N7","v":"A2_Ziele 6"},{"$f":"B_I_Entw_Konzept!O7","v":"-"},null,{"$f":"Tab_IA_VereinsPers[[#This Row],[I-A_Funktionen]]","v":"A2_Ziele 6"},157,{"$f":"IF(ROW(C157)-ROW(C$143)+1>COUNT(Tab_IA_VereinsPers[I-A_Zeile]),\"\",INDEX(F:F,SMALL(Tab_IA_VereinsPers[I-A_Zeile],1+ROW(F157)-ROW($F$143))))","v":"Nachwuchs Strategien"}]
[16,null,{"$f":"B_I_Entw_Konzept!N8","v":"A2_Ziele 7"},{"$f":"B_I_Entw_Konzept!O8","v":"-"},null,{"$f":"Tab_IA_VereinsPers[[#This Row],[I-A_Funktionen]]","v":"A2_Ziele 7"},"",{"$f":"IF(ROW(C158)-ROW(C$143)+1>COUNT(Tab_IA_VereinsPers[I-A_Zeile]),\"\",INDEX(F:F,SMALL(Tab_IA_VereinsPers[I-A_Zeile],1+ROW(F158)-ROW($F$143))))","v":"Veranstaltung"}]
[17,null,{"$f":"B_I_Entw_Konzept!N9","v":"A2_Ziele 8"},{"$f":"B_I_Entw_Konzept!O9","v":"-"},null,{"$f":"Tab_IA_VereinsPers[[#This Row],[I-A_Funktionen]]","v":"A2_Ziele 8"},159,{"$f":"IF(ROW(C159)-ROW(C$143)+1>COUNT(Tab_IA_VereinsPers[I-A_Zeile]),\"\",INDEX(F:F,SMALL(Tab_IA_VereinsPers[I-A_Zeile],1+ROW(F159)-ROW($F$143))))","v":"A3_Strategie 7"}]
[18,null,{"$f":"B_I_Entw_Konzept!N10","v":"A2_Ziele 9"},{"$f":"B_I_Entw_Konzept!O10","v":"-"},null,{"$f":"Tab_IA_VereinsPers[[#This Row],[I-A_Funktionen]]","v":"A2_Ziele 9"},160,{"$f":"IF(ROW(C160)-ROW(C$143)+1>COUNT(Tab_IA_VereinsPers[I-A_Zeile]),\"\",INDEX(F:F,SMALL(Tab_IA_VereinsPers[I-A_Zeile],1+ROW(F160)-ROW($F$143))))","v":"A3_Strategie 8"}]
[19,null,{"$f":"B_I_Entw_Konzept!P2","v":"BEnt1 - Vereinsstrategie"},{"$f":"B_I_Entw_Konzept!Q2","v":0.99},null,{"$f":"Tab_IA_VereinsPers[[#This Row],[I-A_Funktionen]]","v":"BEnt1 - Vereinsstrategie"},161,{"$f":"IF(ROW(C161)-ROW(C$143)+1>COUNT(Tab_IA_VereinsPers[I-A_Zeile]),\"\",INDEX(F:F,SMALL(Tab_IA_VereinsPers[I-A_Zeile],1+ROW(F161)-ROW($F$143))))","v":"Sportliche Aktonsplan"}]
[20,null,{"$f":"B_I_Entw_Konzept!P3","v":"Wirtschaftliche Strategien"},{"$f":"B_I_Entw_Konzept!Q3","v":"-"},null,{"$f":"Tab_IA_VereinsPers[[#This Row],[I-A_Funktionen]]","v":"Wirtschaftliche Strategien"},"",{"$f":"IF(ROW(C162)-ROW(C$143)+1>COUNT(Tab_IA_VereinsPers[I-A_Zeile]),\"\",INDEX(F:F,SMALL(Tab_IA_VereinsPers[I-A_Zeile],1+ROW(F162)-ROW($F$143))))","v":"Wirtschaftliche Aktionsplan"}]
[21,null,{"$f":"B_I_Entw_Konzept!P4","v":"Gesellschaftliche Strategien"},{"$f":"B_I_Entw_Konzept!Q4","v":"-"},null,{"$f":"Tab_IA_VereinsPers[[#This Row],[I-A_Funktionen]]","v":"Gesellschaftliche Strategien"},163,{"$f":"IF(ROW(C163)-ROW(C$143)+1>COUNT(Tab_IA_VereinsPers[I-A_Zeile]),\"\",INDEX(F:F,SMALL(Tab_IA_VereinsPers[I-A_Zeile],1+ROW(F163)-ROW($F$143))))","v":"Gesellschaftliche Aktionsplan"}]
[22,null,{"$f":"B_I_Entw_Konzept!P5","v":"Sportliche Strategien"},{"$f":"B_I_Entw_Konzept!Q5","v":"-"},null,{"$f":"Tab_IA_VereinsPers[[#This Row],[I-A_Funktionen]]","v":"Sportliche Strategien"},164,{"$f":"IF(ROW(C164)-ROW(C$143)+1>COUNT(Tab_IA_VereinsPers[I-A_Zeile]),\"\",INDEX(F:F,SMALL(Tab_IA_VereinsPers[I-A_Zeile],1+ROW(F164)-ROW($F$143))))","v":"A4_Aktionsplan 4"}]
[23,null,{"$f":"B_I_Entw_Konzept!P6","v":"Nachwuchs Strategien"},{"$f":"B_I_Entw_Konzept!Q6","v":"-"},null,{"$f":"Tab_IA_VereinsPers[[#This Row],[I-A_Funktionen]]","v":"Nachwuchs Strategien"},165,{"$f":"IF(ROW(C165)-ROW(C$143)+1>COUNT(Tab_IA_VereinsPers[I-A_Zeile]),\"\",INDEX(F:F,SMALL(Tab_IA_VereinsPers[I-A_Zeile],1+ROW(F165)-ROW($F$143))))","v":"A4_Aktionsplan 5"}]
[24,null,{"$f":"B_I_Entw_Konzept!P7","v":"Veranstaltung"},{"$f":"B_I_Entw_Konzept!Q7","v":"-"},null,{"$f":"Tab_IA_VereinsPers[[#This Row],[I-A_Funktionen]]","v":"Veranstaltung"},166,{"$f":"IF(ROW(C166)-ROW(C$143)+1>COUNT(Tab_IA_VereinsPers[I-A_Zeile]),\"\",INDEX(F:F,SMALL(Tab_IA_VereinsPers[I-A_Zeile],1+ROW(F166)-ROW($F$143))))","v":"A4_Aktionsplan 6"}]
[25,null,{"$f":"B_I_Entw_Konzept!P8","v":"A3_Strategie 7"},{"$f":"B_I_Entw_Konzept!Q8","v":"-"},null,{"$f":"Tab_IA_VereinsPers[[#This Row],[I-A_Funktionen]]","v":"A3_Strategie 7"},167,{"$f":"IF(ROW(C167)-ROW(C$143)+1>COUNT(Tab_IA_VereinsPers[I-A_Zeile]),\"\",INDEX(F:F,SMALL(Tab_IA_VereinsPers[I-A_Zeile],1+ROW(F167)-ROW($F$143))))","v":"A4_Aktionsplan 8"}]
[26,null,{"$f":"B_I_Entw_Konzept!P9","v":"A3_Strategie 8"},{"$f":"B_I_Entw_Konzept!Q9","v":"-"},null,{"$f":"Tab_IA_VereinsPers[[#This Row],[I-A_Funktionen]]","v":"A3_Strategie 8"},168,{"$f":"IF(ROW(C168)-ROW(C$143)+1>COUNT(Tab_IA_VereinsPers[I-A_Zeile]),\"\",INDEX(F:F,SMALL(Tab_IA_VereinsPers[I-A_Zeile],1+ROW(F168)-ROW($F$143))))","v":""}]
[27,null,{"$f":"B_I_Entw_Konzept!P10","v":"A3_Strategie 9"},{"$f":"B_I_Entw_Konzept!Q10","v":"-"},null,{"$f":"Tab_IA_VereinsPers[[#This Row],[I-A_Funktionen]]","v":"A3_Strategie 9"},"",{"$f":"IF(ROW(C169)-ROW(C$143)+1>COUNT(Tab_IA_VereinsPers[I-A_Zeile]),\"\",INDEX(F:F,SMALL(Tab_IA_VereinsPers[I-A_Zeile],1+ROW(F169)-ROW($F$143))))","v":""}]
[28,null,{"$f":"B_I_Entw_Konzept!R2","v":"Sportliche Aktonsplan"},{"$f":"B_I_Entw_Konzept!S2","v":"-"},null,{"$f":"Tab_IA_VereinsPers[[#This Row],[I-A_Funktionen]]","v":"Sportliche Aktonsplan"},170,{"$f":"IF(ROW(C170)-ROW(C$143)+1>COUNT(Tab_IA_VereinsPers[I-A_Zeile]),\"\",INDEX(F:F,SMALL(Tab_IA_VereinsPers[I-A_Zeile],1+ROW(F170)-ROW($F$143))))","v":""}]
[29,null,{"$f":"B_I_Entw_Konzept!R3","v":"Wirtschaftliche Aktionsplan"},{"$f":"B_I_Entw_Konzept!S3","v":"-"},null,{"$f":"Tab_IA_VereinsPers[[#This Row],[I-A_Funktionen]]","v":"Wirtschaftliche Aktionsplan"},171,{"$f":"IF(ROW(C171)-ROW(C$143)+1>COUNT(Tab_IA_VereinsPers[I-A_Zeile]),\"\",INDEX(F:F,SMALL(Tab_IA_VereinsPers[I-A_Zeile],1+ROW(F171)-ROW($F$143))))","v":""}]
[30,null,{"$f":"B_I_Entw_Konzept!R4","v":"Gesellschaftliche Aktionsplan"},{"$f":"B_I_Entw_Konzept!S4","v":"-"},null,{"$f":"Tab_IA_VereinsPers[[#This Row],[I-A_Funktionen]]","v":"Gesellschaftliche Aktionsplan"},172,{"$f":"IF(ROW(C172)-ROW(C$143)+1>COUNT(Tab_IA_VereinsPers[I-A_Zeile]),\"\",INDEX(F:F,SMALL(Tab_IA_VereinsPers[I-A_Zeile],1+ROW(F172)-ROW($F$143))))","v":""}]
[31,null,{"$f":"B_I_Entw_Konzept!R5","v":"A4_Aktionsplan 4"},{"$f":"B_I_Entw_Konzept!S5","v":"-"},null,{"$f":"Tab_IA_VereinsPers[[#This Row],[I-A_Funktionen]]","v":"A4_Aktionsplan 4"},173,{"$f":"IF(ROW(C173)-ROW(C$143)+1>COUNT(Tab_IA_VereinsPers[I-A_Zeile]),\"\",INDEX(F:F,SMALL(Tab_IA_VereinsPers[I-A_Zeile],1+ROW(F173)-ROW($F$143))))","v":""}]
[32,null,{"$f":"B_I_Entw_Konzept!R6","v":"A4_Aktionsplan 5"},{"$f":"B_I_Entw_Konzept!S6","v":"-"},null,{"$f":"Tab_IA_VereinsPers[[#This Row],[I-A_Funktionen]]","v":"A4_Aktionsplan 5"},174,{"$f":"IF(ROW(C174)-ROW(C$143)+1>COUNT(Tab_IA_VereinsPers[I-A_Zeile]),\"\",INDEX(F:F,SMALL(Tab_IA_VereinsPers[I-A_Zeile],1+ROW(F174)-ROW($F$143))))","v":""}]
[33,null,{"$f":"B_I_Entw_Konzept!R7","v":"A4_Aktionsplan 6"},{"$f":"B_I_Entw_Konzept!S7","v":"-"},null,{"$f":"Tab_IA_VereinsPers[[#This Row],[I-A_Funktionen]]","v":"A4_Aktionsplan 6"},175,{"$f":"IF(ROW(C175)-ROW(C$143)+1>COUNT(Tab_IA_VereinsPers[I-A_Zeile]),\"\",INDEX(F:F,SMALL(Tab_IA_VereinsPers[I-A_Zeile],1+ROW(F175)-ROW($F$143))))","v":""}]
[34,null,{"$f":"B_I_Entw_Konzept!R8","v":"A4_Aktionsplan 7"},{"$f":"B_I_Entw_Konzept!S8","v":"-"},null,{"$f":"Tab_IA_VereinsPers[[#This Row],[I-A_Funktionen]]","v":"A4_Aktionsplan 7"},"",{"$f":"IF(ROW(C176)-ROW(C$143)+1>COUNT(Tab_IA_VereinsPers[I-A_Zeile]),\"\",INDEX(F:F,SMALL(Tab_IA_VereinsPers[I-A_Zeile],1+ROW(F176)-ROW($F$143))))","v":""}]
[35,null,{"$f":"B_I_Entw_Konzept!R9","v":"A4_Aktionsplan 8"},{"$f":"B_I_Entw_Konzept!S9","v":"-"},null,{"$f":"Tab_IA_VereinsPers[[#This Row],[I-A_Funktionen]]","v":"A4_Aktionsplan 8"},177,{"$f":"IF(ROW(C177)-ROW(C$143)+1>COUNT(Tab_IA_VereinsPers[I-A_Zeile]),\"\",INDEX(F:F,SMALL(Tab_IA_VereinsPers[I-A_Zeile],1+ROW(F177)-ROW($F$143))))","v":""}]
[36,null,{"$f":"B_I_Entw_Konzept!R10","v":"A4_Aktionsplan 9"},{"$f":"B_I_Entw_Konzept!S10","v":"-"},null,{"$f":"Tab_IA_VereinsPers[[#This Row],[I-A_Funktionen]]","v":"A4_Aktionsplan 9"},"",{"$f":"IF(ROW(C178)-ROW(C$143)+1>COUNT(Tab_IA_VereinsPers[I-A_Zeile]),\"\",INDEX(F:F,SMALL(Tab_IA_VereinsPers[I-A_Zeile],1+ROW(F178)-ROW($F$143))))","v":""}]
[]
["L_Nr.","I. Entwicklungskonzept","I-B_Funktionen","I-B_Werte","I-B_100%","I-B_Funktion","I-B_Zeile","I-B_noch möglich"]
[37,{"$f":"B_I_Entw_Konzept!$B$6","v":"B. (Aus)Bildungsperspektive"},{"$f":"B_I_Entw_Konzept!L13","v":"Kompetenzen Know How Fkt."},{"$f":"B_I_Entw_Konzept!M13","v":"-"},null,{"$f":"Tab_IB_AusBildPer[[#This Row],[I-B_Funktionen]]","v":"Kompetenzen Know How Fkt."},{"$f":"IF(COUNTIF($C$17:$C$28,F181)>=1,\"\",ROW())","v":""},{"$f":"IF(ROW(C181)-ROW(C$181)+1>COUNT(Tab_IB_AusBildPer[I-B_Zeile]),\"\",INDEX(F:F,SMALL(Tab_IB_AusBildPer[I-B_Zeile],1+ROW(F181)-ROW($F$181))))","v":"Berufliche Fähigkeiten Fkt."}]
[38,null,{"$f":"B_I_Entw_Konzept!L14","v":"Fachwissen Know How Fkt."},{"$f":"B_I_Entw_Konzept!M14","v":"-"},null,{"$f":"Tab_IB_AusBildPer[[#This Row],[I-B_Funktionen]]","v":"Fachwissen Know How Fkt."},{"$f":"IF(COUNTIF($C$17:$C$28,F182)>=1,\"\",ROW())","v":""},{"$f":"IF(ROW(C182)-ROW(C$181)+1>COUNT(Tab_IB_AusBildPer[I-B_Zeile]),\"\",INDEX(F:F,SMALL(Tab_IB_AusBildPer[I-B_Zeile],1+ROW(F182)-ROW($F$181))))","v":"Weiterbildung Fkt."}]
[39,null,{"$f":"B_I_Entw_Konzept!L15","v":"Berufliche Fähigkeiten Fkt."},{"$f":"B_I_Entw_Konzept!M15","v":"-"},null,{"$f":"Tab_IB_AusBildPer[[#This Row],[I-B_Funktionen]]","v":"Berufliche Fähigkeiten Fkt."},183,{"$f":"IF(ROW(C183)-ROW(C$181)+1>COUNT(Tab_IB_AusBildPer[I-B_Zeile]),\"\",INDEX(F:F,SMALL(Tab_IB_AusBildPer[I-B_Zeile],1+ROW(F183)-ROW($F$181))))","v":"Standing in der Region Fkt."}]
[40,null,{"$f":"B_I_Entw_Konzept!L16","v":"Soziale Kompetenz Fkt."},{"$f":"B_I_Entw_Konzept!M16","v":"-"},null,{"$f":"Tab_IB_AusBildPer[[#This Row],[I-B_Funktionen]]","v":"Soziale Kompetenz Fkt."},"",{"$f":"IF(ROW(C184)-ROW(C$181)+1>COUNT(Tab_IB_AusBildPer[I-B_Zeile]),\"\",INDEX(F:F,SMALL(Tab_IB_AusBildPer[I-B_Zeile],1+ROW(F184)-ROW($F$181))))","v":"Zeitliche Ressourcen Fkt."}]
[41,null,{"$f":"B_I_Entw_Konzept!L17","v":"Weiterbildung Fkt."},{"$f":"B_I_Entw_Konzept!M17","v":"-"},null,{"$f":"Tab_IB_AusBildPer[[#This Row],[I-B_Funktionen]]","v":"Weiterbildung Fkt."},185,{"$f":"IF(ROW(C185)-ROW(C$181)+1>COUNT(Tab_IB_AusBildPer[I-B_Zeile]),\"\",INDEX(F:F,SMALL(Tab_IB_AusBildPer[I-B_Zeile],1+ROW(F185)-ROW($F$181))))","v":"Identifikation Fkt."}]
[42,null,{"$f":"B_I_Entw_Konzept!L18","v":"Standing in der Region Fkt."},{"$f":"B_I_Entw_Konzept!M18","v":"-"},null,{"$f":"Tab_IB_AusBildPer[[#This Row],[I-B_Funktionen]]","v":"Standing in der Region Fkt."},186,{"$f":"IF(ROW(C186)-ROW(C$181)+1>COUNT(Tab_IB_AusBildPer[I-B_Zeile]),\"\",INDEX(F:F,SMALL(Tab_IB_AusBildPer[I-B_Zeile],1+ROW(F186)-ROW($F$181))))","v":"Muster_1 Fkt."}]
[43,null,{"$f":"B_I_Entw_Konzept!L19","v":"Zeitliche Ressourcen Fkt."},{"$f":"B_I_Entw_Konzept!M19","v":"-"},null,{"$f":"Tab_IB_AusBildPer[[#This Row],[I-B_Funktionen]]","v":"Zeitliche Ressourcen Fkt."},187,{"$f":"IF(ROW(C187)-ROW(C$181)+1>COUNT(Tab_IB_AusBildPer[I-B_Zeile]),\"\",INDEX(F:F,SMALL(Tab_IB_AusBildPer[I-B_Zeile],1+ROW(F187)-ROW($F$181))))","v":"Kompetenzen Verwaltungsfunktionär"}]
[44,null,{"$f":"B_I_Entw_Konzept!L20","v":"Identifikation Fkt."},{"$f":"B_I_Entw_Konzept!M20","v":"-"},null,{"$f":"Tab_IB_AusBildPer[[#This Row],[I-B_Funktionen]]","v":"Identifikation Fkt."},188,{"$f":"IF(ROW(C188)-ROW(C$181)+1>COUNT(Tab_IB_AusBildPer[I-B_Zeile]),\"\",INDEX(F:F,SMALL(Tab_IB_AusBildPer[I-B_Zeile],1+ROW(F188)-ROW($F$181))))","v":"Fachwissen  Verwaltungsfunktionär"}]
[45,null,{"$f":"B_I_Entw_Konzept!L21","v":"Muster_1 Fkt."},{"$f":"B_I_Entw_Konzept!M21","v":"-"},null,{"$f":"Tab_IB_AusBildPer[[#This Row],[I-B_Funktionen]]","v":"Muster_1 Fkt."},189,{"$f":"IF(ROW(C189)-ROW(C$181)+1>COUNT(Tab_IB_AusBildPer[I-B_Zeile]),\"\",INDEX(F:F,SMALL(Tab_IB_AusBildPer[I-B_Zeile],1+ROW(F189)-ROW($F$181))))","v":"Berufliche Fähigkeiten  Verw.Funktionär"}]
[46,null,{"$f":"B_I_Entw_Konzept!N13","v":"Kompetenzen Verwaltungsfunktionär"},{"$f":"B_I_Entw_Konzept!O13","v":"-"},null,{"$f":"Tab_IB_AusBildPer[[#This Row],[I-B_Funktionen]]","v":"Kompetenzen Verwaltungsfunktionär"},190,{"$f":"IF(ROW(C190)-ROW(C$181)+1>COUNT(Tab_IB_AusBildPer[I-B_Zeile]),\"\",INDEX(F:F,SMALL(Tab_IB_AusBildPer[I-B_Zeile],1+ROW(F190)-ROW($F$181))))","v":"Soziale Kompetenz Verw_Fkt."}]
[47,null,{"$f":"B_I_Entw_Konzept!N14","v":"Fachwissen  Verwaltungsfunktionär"},{"$f":"B_I_Entw_Konzept!O14","v":"-"},null,{"$f":"Tab_IB_AusBildPer[[#This Row],[I-B_Funktionen]]","v":"Fachwissen  Verwaltungsfunktionär"},191,{"$f":"IF(ROW(C191)-ROW(C$181)+1>COUNT(Tab_IB_AusBildPer[I-B_Zeile]),\"\",INDEX(F:F,SMALL(Tab_IB_AusBildPer[I-B_Zeile],1+ROW(F191)-ROW($F$181))))","v":"Standing in der Region Verw_Fkt."}]
[48,null,{"$f":"B_I_Entw_Konzept!N15","v":"Berufliche Fähigkeiten  Verw.Funktionär"},{"$f":"B_I_Entw_Konzept!O15","v":"-"},null,{"$f":"Tab_IB_AusBildPer[[#This Row],[I-B_Funktionen]]","v":"Berufliche Fähigkeiten  Verw.Funktionär"},192,{"$f":"IF(ROW(C192)-ROW(C$181)+1>COUNT(Tab_IB_AusBildPer[I-B_Zeile]),\"\",INDEX(F:F,SMALL(Tab_IB_AusBildPer[I-B_Zeile],1+ROW(F192)-ROW($F$181))))","v":"Zeitliche Ressourcen Verw_Fkt."}]
[49,null,{"$f":"B_I_Entw_Konzept!N16","v":"Soziale Kompetenz Verw_Fkt."},{"$f":"B_I_Entw_Konzept!O16","v":"-"},null,{"$f":"Tab_IB_AusBildPer[[#This Row],[I-B_Funktionen]]","v":"Soziale Kompetenz Verw_Fkt."},193,{"$f":"IF(ROW(C193)-ROW(C$181)+1>COUNT(Tab_IB_AusBildPer[I-B_Zeile]),\"\",INDEX(F:F,SMALL(Tab_IB_AusBildPer[I-B_Zeile],1+ROW(F193)-ROW($F$181))))","v":"Identifikation Verw_Fkt."}]
[50,null,{"$f":"B_I_Entw_Konzept!N17","v":"Weiterbildung Verw_Fkt."},{"$f":"B_I_Entw_Konzept!O17","v":"-"},null,{"$f":"Tab_IB_AusBildPer[[#This Row],[I-B_Funktionen]]","v":"Weiterbildung Verw_Fkt."},"",{"$f":"IF(ROW(C194)-ROW(C$181)+1>COUNT(Tab_IB_AusBildPer[I-B_Zeile]),\"\",INDEX(F:F,SMALL(Tab_IB_AusBildPer[I-B_Zeile],1+ROW(F194)-ROW($F$181))))","v":"Test-Muster_2 Verw_Fkt."}]
[51,null,{"$f":"B_I_Entw_Konzept!N18","v":"Standing in der Region Verw_Fkt."},{"$f":"B_I_Entw_Konzept!O18","v":"-"},null,{"$f":"Tab_IB_AusBildPer[[#This Row],[I-B_Funktionen]]","v":"Standing in der Region Verw_Fkt."},195,{"$f":"IF(ROW(C195)-ROW(C$181)+1>COUNT(Tab_IB_AusBildPer[I-B_Zeile]),\"\",INDEX(F:F,SMALL(Tab_IB_AusBildPer[I-B_Zeile],1+ROW(F195)-ROW($F$181))))","v":"Kompetenzen Sportfunktionär"}]
[52,null,{"$f":"B_I_Entw_Konzept!N19","v":"Zeitliche Ressourcen Verw_Fkt."},{"$f":"B_I_Entw_Konzept!O19","v":"-"},null,{"$f":"Tab_IB_AusBildPer[[#This Row],[I-B_Funktionen]]","v":"Zeitliche Ressourcen Verw_Fkt."},196,{"$f":"IF(ROW(C196)-ROW(C$181)+1>COUNT(Tab_IB_AusBildPer[I-B_Zeile]),\"\",INDEX(F:F,SMALL(Tab_IB_AusBildPer[I-B_Zeile],1+ROW(F196)-ROW($F$181))))","v":"Fachwissen Sportfunktionär"}]
[53,null,{"$f":"B_I_Entw_Konzept!N20","v":"Identifikation Verw_Fkt."},{"$f":"B_I_Entw_Konzept!O20","v":"-"},null,{"$f":"Tab_IB_AusBildPer[[#This Row],[I-B_Funktionen]]","v":"Identifikation Verw_Fkt."},197,{"$f":"IF(ROW(C197)-ROW(C$181)+1>COUNT(Tab_IB_AusBildPer[I-B_Zeile]),\"\",INDEX(F:F,SMALL(Tab_IB_AusBildPer[I-B_Zeile],1+ROW(F197)-ROW($F$181))))","v":"Berufliche Fähigkeiten Sportfunktionär"}]
[54,null,{"$f":"B_I_Entw_Konzept!N21","v":"Test-Muster_2 Verw_Fkt."},{"$f":"B_I_Entw_Konzept!O21","v":"-"},null,{"$f":"Tab_IB_AusBildPer[[#This Row],[I-B_Funktionen]]","v":"Test-Muster_2 Verw_Fkt."},198,{"$f":"IF(ROW(C198)-ROW(C$181)+1>COUNT(Tab_IB_AusBildPer[I-B_Zeile]),\"\",INDEX(F:F,SMALL(Tab_IB_AusBildPer[I-B_Zeile],1+ROW(F198)-ROW($F$181))))","v":"Soziale Kompetenz Sp_Fkt."}]
[55,null,{"$f":"B_I_Entw_Konzept!P13","v":"Kompetenzen Sportfunktionär"},{"$f":"B_I_Entw_Konzept!Q13","v":"-"},null,{"$f":"Tab_IB_AusBildPer[[#This Row],[I-B_Funktionen]]","v":"Kompetenzen Sportfunktionär"},199,{"$f":"IF(ROW(C199)-ROW(C$181)+1>COUNT(Tab_IB_AusBildPer[I-B_Zeile]),\"\",INDEX(F:F,SMALL(Tab_IB_AusBildPer[I-B_Zeile],1+ROW(F199)-ROW($F$181))))","v":"Standing in der Region Sp_Fkt."}]
[56,null,{"$f":"B_I_Entw_Konzept!P14","v":"Fachwissen Sportfunktionär"},{"$f":"B_I_Entw_Konzept!Q14","v":"-"},null,{"$f":"Tab_IB_AusBildPer[[#This Row],[I-B_Funktionen]]","v":"Fachwissen Sportfunktionär"},200,{"$f":"IF(ROW(C200)-ROW(C$181)+1>COUNT(Tab_IB_AusBildPer[I-B_Zeile]),\"\",INDEX(F:F,SMALL(Tab_IB_AusBildPer[I-B_Zeile],1+ROW(F200)-ROW($F$181))))","v":"Zeitliche Ressourcen Sp_Fkt."}]
[57,null,{"$f":"B_I_Entw_Konzept!P15","v":"Berufliche Fähigkeiten Sportfunktionär"},{"$f":"B_I_Entw_Konzept!Q15","v":"-"},null,{"$f":"Tab_IB_AusBildPer[[#This Row],[I-B_Funktionen]]","v":"Berufliche Fähigkeiten Sportfunktionär"},201,{"$f":"IF(ROW(C201)-ROW(C$181)+1>COUNT(Tab_IB_AusBildPer[I-B_Zeile]),\"\",INDEX(F:F,SMALL(Tab_IB_AusBildPer[I-B_Zeile],1+ROW(F201)-ROW($F$181))))","v":"Fachwissen Vermarktungsfunktionär"}]
[58,null,{"$f":"B_I_Entw_Konzept!P16","v":"Soziale Kompetenz Sp_Fkt."},{"$f":"B_I_Entw_Konzept!Q16","v":"-"},null,{"$f":"Tab_IB_AusBildPer[[#This Row],[I-B_Funktionen]]","v":"Soziale Kompetenz Sp_Fkt."},202,{"$f":"IF(ROW(C202)-ROW(C$181)+1>COUNT(Tab_IB_AusBildPer[I-B_Zeile]),\"\",INDEX(F:F,SMALL(Tab_IB_AusBildPer[I-B_Zeile],1+ROW(F202)-ROW($F$181))))","v":"Berufliche Fähigkeiten Verm.Funktionär"}]
[59,null,{"$f":"B_I_Entw_Konzept!P17","v":"Weiterbildung Sp_Fkt."},{"$f":"B_I_Entw_Konzept!Q17","v":"-"},null,{"$f":"Tab_IB_AusBildPer[[#This Row],[I-B_Funktionen]]","v":"Weiterbildung Sp_Fkt."},"",{"$f":"IF(ROW(C203)-ROW(C$181)+1>COUNT(Tab_IB_AusBildPer[I-B_Zeile]),\"\",INDEX(F:F,SMALL(Tab_IB_AusBildPer[I-B_Zeile],1+ROW(F203)-ROW($F$181))))","v":"Soziale Kompetenz  Vermarktungsfunktionär"}]
[60,null,{"$f":"B_I_Entw_Konzept!P18","v":"Standing in der Region Sp_Fkt."},{"$f":"B_I_Entw_Konzept!Q18","v":"-"},null,{"$f":"Tab_IB_AusBildPer[[#This Row],[I-B_Funktionen]]","v":"Standing in der Region Sp_Fkt."},204,{"$f":"IF(ROW(C204)-ROW(C$181)+1>COUNT(Tab_IB_AusBildPer[I-B_Zeile]),\"\",INDEX(F:F,SMALL(Tab_IB_AusBildPer[I-B_Zeile],1+ROW(F204)-ROW($F$181))))","v":"Identifikation Verm_Fkt."}]
[61,null,{"$f":"B_I_Entw_Konzept!P19","v":"Zeitliche Ressourcen Sp_Fkt."},{"$f":"B_I_Entw_Konzept!Q19","v":"-"},null,{"$f":"Tab_IB_AusBildPer[[#This Row],[I-B_Funktionen]]","v":"Zeitliche Ressourcen Sp_Fkt."},205,{"$f":"IF(ROW(C205)-ROW(C$181)+1>COUNT(Tab_IB_AusBildPer[I-B_Zeile]),\"\",INDEX(F:F,SMALL(Tab_IB_AusBildPer[I-B_Zeile],1+ROW(F205)-ROW($F$181))))","v":""}]
[62,null,{"$f":"B_I_Entw_Konzept!P20","v":"Identifikation Sp_Fkt."},{"$f":"B_I_Entw_Konzept!Q20","v":"-"},null,{"$f":"Tab_IB_AusBildPer[[#This Row],[I-B_Funktionen]]","v":"Identifikation Sp_Fkt."},"",{"$f":"IF(ROW(C206)-ROW(C$181)+1>COUNT(Tab_IB_AusBildPer[I-B_Zeile]),\"\",INDEX(F:F,SMALL(Tab_IB_AusBildPer[I-B_Zeile],1+ROW(F206)-ROW($F$181))))","v":""}]
[63,null,{"$f":"B_I_Entw_Konzept!P21","v":"Test-Muster_3 Sp_Fkt."},{"$f":"B_I_Entw_Konzept!Q21","v":"-"},null,{"$f":"Tab_IB_AusBildPer[[#This Row],[I-B_Funktionen]]","v":"Test-Muster_3 Sp_Fkt."},"",{"$f":"IF(ROW(C207)-ROW(C$181)+1>COUNT(Tab_IB_AusBildPer[I-B_Zeile]),\"\",INDEX(F:F,SMALL(Tab_IB_AusBildPer[I-B_Zeile],1+ROW(F207)-ROW($F$181))))","v":""}]
[64,null,{"$f":"B_I_Entw_Konzept!R13","v":"Kompetenzen Vermarktungsfunktionär"},{"$f":"B_I_Entw_Konzept!S13","v":"-"},null,{"$f":"Tab_IB_AusBildPer[[#This Row],[I-B_Funktionen]]","v":"Kompetenzen Vermarktungsfunktionär"},"",{"$f":"IF(ROW(C208)-ROW(C$181)+1>COUNT(Tab_IB_AusBildPer[I-B_Zeile]),\"\",INDEX(F:F,SMALL(Tab_IB_AusBildPer[I-B_Zeile],1+ROW(F208)-ROW($F$181))))","v":""}]
[65,null,{"$f":"B_I_Entw_Konzept!R14","v":"Fachwissen Vermarktungsfunktionär"},{"$f":"B_I_Entw_Konzept!S14","v":"-"},null,{"$f":"Tab_IB_AusBildPer[[#This Row],[I-B_Funktionen]]","v":"Fachwissen Vermarktungsfunktionär"},209,{"$f":"IF(ROW(C209)-ROW(C$181)+1>COUNT(Tab_IB_AusBildPer[I-B_Zeile]),\"\",INDEX(F:F,SMALL(Tab_IB_AusBildPer[I-B_Zeile],1+ROW(F209)-ROW($F$181))))","v":""}]
[66,null,{"$f":"B_I_Entw_Konzept!R15","v":"Berufliche Fähigkeiten Verm.Funktionär"},{"$f":"B_I_Entw_Konzept!S15","v":"-"},null,{"$f":"Tab_IB_AusBildPer[[#This Row],[I-B_Funktionen]]","v":"Berufliche Fähigkeiten Verm.Funktionär"},210,{"$f":"IF(ROW(C210)-ROW(C$181)+1>COUNT(Tab_IB_AusBildPer[I-B_Zeile]),\"\",INDEX(F:F,SMALL(Tab_IB_AusBildPer[I-B_Zeile],1+ROW(F210)-ROW($F$181))))","v":""}]
[67,null,{"$f":"B_I_Entw_Konzept!R16","v":"Soziale Kompetenz  Vermarktungsfunktionär"},{"$f":"B_I_Entw_Konzept!S16","v":"-"},null,{"$f":"Tab_IB_AusBildPer[[#This Row],[I-B_Funktionen]]","v":"Soziale Kompetenz  Vermarktungsfunktionär"},211,{"$f":"IF(ROW(C211)-ROW(C$181)+1>COUNT(Tab_IB_AusBildPer[I-B_Zeile]),\"\",INDEX(F:F,SMALL(Tab_IB_AusBildPer[I-B_Zeile],1+ROW(F211)-ROW($F$181))))","v":""}]
[68,null,{"$f":"B_I_Entw_Konzept!R17","v":"Weiterbildung Vermarktungsfunktionär"},{"$f":"B_I_Entw_Konzept!S17","v":"-"},null,{"$f":"Tab_IB_AusBildPer[[#This Row],[I-B_Funktionen]]","v":"Weiterbildung Vermarktungsfunktionär"},"",{"$f":"IF(ROW(C212)-ROW(C$181)+1>COUNT(Tab_IB_AusBildPer[I-B_Zeile]),\"\",INDEX(F:F,SMALL(Tab_IB_AusBildPer[I-B_Zeile],1+ROW(F212)-ROW($F$181))))","v":""}]
[69,null,{"$f":"B_I_Entw_Konzept!R18","v":"Standing in der Region Verm_Fkt."},{"$f":"B_I_Entw_Konzept!S18","v":"-"},null,{"$f":"Tab_IB_AusBildPer[[#This Row],[I-B_Funktionen]]","v":"Standing in der Region Verm_Fkt."},"",{"$f":"IF(ROW(C213)-ROW(C$181)+1>COUNT(Tab_IB_AusBildPer[I-B_Zeile]),\"\",INDEX(F:F,SMALL(Tab_IB_AusBildPer[I-B_Zeile],1+ROW(F213)-ROW($F$181))))","v":""}]
[70,null,{"$f":"B_I_Entw_Konzept!R19","v":"Zeitliche Ressourcen Verm_Fkt."},{"$f":"B_I_Entw_Konzept!S19","v":"-"},null,{"$f":"Tab_IB_AusBildPer[[#This Row],[I-B_Funktionen]]","v":"Zeitliche Ressourcen Verm_Fkt."},"",{"$f":"IF(ROW(C214)-ROW(C$181)+1>COUNT(Tab_IB_AusBildPer[I-B_Zeile]),\"\",INDEX(F:F,SMALL(Tab_IB_AusBildPer[I-B_Zeile],1+ROW(F214)-ROW($F$181))))","v":""}]
[71,null,{"$f":"B_I_Entw_Konzept!R20","v":"Identifikation Verm_Fkt."},{"$f":"B_I_Entw_Konzept!S20","v":"-"},null,{"$f":"Tab_IB_AusBildPer[[#This Row],[I-B_Funktionen]]","v":"Identifikation Verm_Fkt."},215,{"$f":"IF(ROW(C215)-ROW(C$181)+1>COUNT(Tab_IB_AusBildPer[I-B_Zeile]),\"\",INDEX(F:F,SMALL(Tab_IB_AusBildPer[I-B_Zeile],1+ROW(F215)-ROW($F$181))))","v":""}]
[72,null,{"$f":"B_I_Entw_Konzept!R21","v":"Test Verm_Fkt."},{"$f":"B_I_Entw_Konzept!S21","v":"-"},null,{"$f":"Tab_IB_AusBildPer[[#This Row],[I-B_Funktionen]]","v":"Test Verm_Fkt."},"",{"$f":"IF(ROW(C216)-ROW(C$181)+1>COUNT(Tab_IB_AusBildPer[I-B_Zeile]),\"\",INDEX(F:F,SMALL(Tab_IB_AusBildPer[I-B_Zeile],1+ROW(F216)-ROW($F$181))))","v":""}]
[]
["L_Nr.","II. Verwaltungskonzept","II-C_Funktionen","II-C_Werte","II-C_100%","II-C_Funktion","II-C_Zeile","II-C_noch möglich"]
[73,{"$f":"B_II_Verw_Konzept!B5","v":"C. Verwaltungsperspektive"},{"$f":"B_II_Verw_Konzept!L2","v":"Effektive Verwaltung_1"},{"$f":"B_II_Verw_Konzept!M2","v":"-"},null,{"$f":"Tab_IIC_VerwaPer[[#This Row],[II-C_Funktionen]]","v":"Effektive Verwaltung_1"},{"$f":"IF(COUNTIF($C$30:$C$41,F219)>=1,\"\",ROW())","v":""},{"$f":"IF(ROW(C219)-ROW(C$219)+1>COUNT(Tab_IIC_VerwaPer[II-C_Zeile]),\"\",INDEX(F:F,SMALL(Tab_IIC_VerwaPer[II-C_Zeile],1+ROW(F219)-ROW($F$219))))","v":"Effektive Verwaltung_2"}]
[74,null,{"$f":"B_II_Verw_Konzept!L3","v":"Effektive Verwaltung_2"},{"$f":"B_II_Verw_Konzept!M3","v":"-"},null,{"$f":"Tab_IIC_VerwaPer[[#This Row],[II-C_Funktionen]]","v":"Effektive Verwaltung_2"},220,{"$f":"IF(ROW(C220)-ROW(C$219)+1>COUNT(Tab_IIC_VerwaPer[II-C_Zeile]),\"\",INDEX(F:F,SMALL(Tab_IIC_VerwaPer[II-C_Zeile],1+ROW(F220)-ROW($F$219))))","v":"Effektive Verwaltung_3"}]
[75,null,{"$f":"B_II_Verw_Konzept!L4","v":"Effektive Verwaltung_3"},{"$f":"B_II_Verw_Konzept!M4","v":"-"},null,{"$f":"Tab_IIC_VerwaPer[[#This Row],[II-C_Funktionen]]","v":"Effektive Verwaltung_3"},221,{"$f":"IF(ROW(C221)-ROW(C$219)+1>COUNT(Tab_IIC_VerwaPer[II-C_Zeile]),\"\",INDEX(F:F,SMALL(Tab_IIC_VerwaPer[II-C_Zeile],1+ROW(F221)-ROW($F$219))))","v":"Effektive Verwaltung_4"}]
[76,null,{"$f":"B_II_Verw_Konzept!L5","v":"Effektive Verwaltung_4"},{"$f":"B_II_Verw_Konzept!M5","v":"-"},null,{"$f":"Tab_IIC_VerwaPer[[#This Row],[II-C_Funktionen]]","v":"Effektive Verwaltung_4"},222,{"$f":"IF(ROW(C222)-ROW(C$219)+1>COUNT(Tab_IIC_VerwaPer[II-C_Zeile]),\"\",INDEX(F:F,SMALL(Tab_IIC_VerwaPer[II-C_Zeile],1+ROW(F222)-ROW($F$219))))","v":"Effektive Verwaltung_5"}]
[77,null,{"$f":"B_II_Verw_Konzept!L6","v":"Effektive Verwaltung_5"},{"$f":"B_II_Verw_Konzept!M6","v":"-"},null,{"$f":"Tab_IIC_VerwaPer[[#This Row],[II-C_Funktionen]]","v":"Effektive Verwaltung_5"},223,{"$f":"IF(ROW(C223)-ROW(C$219)+1>COUNT(Tab_IIC_VerwaPer[II-C_Zeile]),\"\",INDEX(F:F,SMALL(Tab_IIC_VerwaPer[II-C_Zeile],1+ROW(F223)-ROW($F$219))))","v":"Effektive Verwaltung_8"}]
[78,null,{"$f":"B_II_Verw_Konzept!L7","v":"Effektive Verwaltung_6"},{"$f":"B_II_Verw_Konzept!M7","v":"-"},null,{"$f":"Tab_IIC_VerwaPer[[#This Row],[II-C_Funktionen]]","v":"Effektive Verwaltung_6"},"",{"$f":"IF(ROW(C224)-ROW(C$219)+1>COUNT(Tab_IIC_VerwaPer[II-C_Zeile]),\"\",INDEX(F:F,SMALL(Tab_IIC_VerwaPer[II-C_Zeile],1+ROW(F224)-ROW($F$219))))","v":"Effektive Verwaltung_9"}]
[79,null,{"$f":"B_II_Verw_Konzept!L8","v":"Effektive Verwaltung_7"},{"$f":"B_II_Verw_Konzept!M8","v":"-"},null,{"$f":"Tab_IIC_VerwaPer[[#This Row],[II-C_Funktionen]]","v":"Effektive Verwaltung_7"},"",{"$f":"IF(ROW(C225)-ROW(C$219)+1>COUNT(Tab_IIC_VerwaPer[II-C_Zeile]),\"\",INDEX(F:F,SMALL(Tab_IIC_VerwaPer[II-C_Zeile],1+ROW(F225)-ROW($F$219))))","v":"Rahmenbedingungen_2"}]
[80,null,{"$f":"B_II_Verw_Konzept!L9","v":"Effektive Verwaltung_8"},{"$f":"B_II_Verw_Konzept!M9","v":"-"},null,{"$f":"Tab_IIC_VerwaPer[[#This Row],[II-C_Funktionen]]","v":"Effektive Verwaltung_8"},226,{"$f":"IF(ROW(C226)-ROW(C$219)+1>COUNT(Tab_IIC_VerwaPer[II-C_Zeile]),\"\",INDEX(F:F,SMALL(Tab_IIC_VerwaPer[II-C_Zeile],1+ROW(F226)-ROW($F$219))))","v":"Rahmenbedingungen_3"}]
[81,null,{"$f":"B_II_Verw_Konzept!L10","v":"Effektive Verwaltung_9"},{"$f":"B_II_Verw_Konzept!M10","v":"-"},null,{"$f":"Tab_IIC_VerwaPer[[#This Row],[II-C_Funktionen]]","v":"Effektive Verwaltung_9"},227,{"$f":"IF(ROW(C227)-ROW(C$219)+1>COUNT(Tab_IIC_VerwaPer[II-C_Zeile]),\"\",INDEX(F:F,SMALL(Tab_IIC_VerwaPer[II-C_Zeile],1+ROW(F227)-ROW($F$219))))","v":"Rahmenbedingungen_4"}]
[82,null,{"$f":"B_II_Verw_Konzept!N2","v":"Rahmenbedingungen"},{"$f":"B_II_Verw_Konzept!O2","v":"-"},null,{"$f":"Tab_IIC_VerwaPer[[#This Row],[II-C_Funktionen]]","v":"Rahmenbedingungen"},"",{"$f":"IF(ROW(C228)-ROW(C$219)+1>COUNT(Tab_IIC_VerwaPer[II-C_Zeile]),\"\",INDEX(F:F,SMALL(Tab_IIC_VerwaPer[II-C_Zeile],1+ROW(F228)-ROW($F$219))))","v":"Rahmenbedingungen_6"}]
[83,null,{"$f":"B_II_Verw_Konzept!N3","v":"Rahmenbedingungen_2"},{"$f":"B_II_Verw_Konzept!O3","v":"-"},null,{"$f":"Tab_IIC_VerwaPer[[#This Row],[II-C_Funktionen]]","v":"Rahmenbedingungen_2"},229,{"$f":"IF(ROW(C229)-ROW(C$219)+1>COUNT(Tab_IIC_VerwaPer[II-C_Zeile]),\"\",INDEX(F:F,SMALL(Tab_IIC_VerwaPer[II-C_Zeile],1+ROW(F229)-ROW($F$219))))","v":"Rahmenbedingungen_8"}]
[84,null,{"$f":"B_II_Verw_Konzept!N4","v":"Rahmenbedingungen_3"},{"$f":"B_II_Verw_Konzept!O4","v":"-"},null,{"$f":"Tab_IIC_VerwaPer[[#This Row],[II-C_Funktionen]]","v":"Rahmenbedingungen_3"},230,{"$f":"IF(ROW(C230)-ROW(C$219)+1>COUNT(Tab_IIC_VerwaPer[II-C_Zeile]),\"\",INDEX(F:F,SMALL(Tab_IIC_VerwaPer[II-C_Zeile],1+ROW(F230)-ROW($F$219))))","v":"Infrastruktur_5"}]
[85,null,{"$f":"B_II_Verw_Konzept!N5","v":"Rahmenbedingungen_4"},{"$f":"B_II_Verw_Konzept!O5","v":"-"},null,{"$f":"Tab_IIC_VerwaPer[[#This Row],[II-C_Funktionen]]","v":"Rahmenbedingungen_4"},231,{"$f":"IF(ROW(C231)-ROW(C$219)+1>COUNT(Tab_IIC_VerwaPer[II-C_Zeile]),\"\",INDEX(F:F,SMALL(Tab_IIC_VerwaPer[II-C_Zeile],1+ROW(F231)-ROW($F$219))))","v":"Infrastruktur_6"}]
[86,null,{"$f":"B_II_Verw_Konzept!N6","v":"Rahmenbedingungen_5"},{"$f":"B_II_Verw_Konzept!O6","v":"-"},null,{"$f":"Tab_IIC_VerwaPer[[#This Row],[II-C_Funktionen]]","v":"Rahmenbedingungen_5"},"",{"$f":"IF(ROW(C232)-ROW(C$219)+1>COUNT(Tab_IIC_VerwaPer[II-C_Zeile]),\"\",INDEX(F:F,SMALL(Tab_IIC_VerwaPer[II-C_Zeile],1+ROW(F232)-ROW($F$219))))","v":"Infrastruktur_7"}]
[87,null,{"$f":"B_II_Verw_Konzept!N7","v":"Rahmenbedingungen_6"},{"$f":"B_II_Verw_Konzept!O7","v":"-"},null,{"$f":"Tab_IIC_VerwaPer[[#This Row],[II-C_Funktionen]]","v":"Rahmenbedingungen_6"},233,{"$f":"IF(ROW(C233)-ROW(C$219)+1>COUNT(Tab_IIC_VerwaPer[II-C_Zeile]),\"\",INDEX(F:F,SMALL(Tab_IIC_VerwaPer[II-C_Zeile],1+ROW(F233)-ROW($F$219))))","v":"Infrastruktur_9"}]
[88,null,{"$f":"B_II_Verw_Konzept!N8","v":"Rahmenbedingungen_7"},{"$f":"B_II_Verw_Konzept!O8","v":"-"},null,{"$f":"Tab_IIC_VerwaPer[[#This Row],[II-C_Funktionen]]","v":"Rahmenbedingungen_7"},"",{"$f":"IF(ROW(C234)-ROW(C$219)+1>COUNT(Tab_IIC_VerwaPer[II-C_Zeile]),\"\",INDEX(F:F,SMALL(Tab_IIC_VerwaPer[II-C_Zeile],1+ROW(F234)-ROW($F$219))))","v":""}]
[89,null,{"$f":"B_II_Verw_Konzept!N9","v":"Rahmenbedingungen_8"},{"$f":"B_II_Verw_Konzept!O9","v":"-"},null,{"$f":"Tab_IIC_VerwaPer[[#This Row],[II-C_Funktionen]]","v":"Rahmenbedingungen_8"},235,{"$f":"IF(ROW(C235)-ROW(C$219)+1>COUNT(Tab_IIC_VerwaPer[II-C_Zeile]),\"\",INDEX(F:F,SMALL(Tab_IIC_VerwaPer[II-C_Zeile],1+ROW(F235)-ROW($F$219))))","v":""}]
[90,null,{"$f":"B_II_Verw_Konzept!N10","v":"Rahmenbedingungen_9"},{"$f":"B_II_Verw_Konzept!O10","v":"-"},null,{"$f":"Tab_IIC_VerwaPer[[#This Row],[II-C_Funktionen]]","v":"Rahmenbedingungen_9"},"",{"$f":"IF(ROW(C236)-ROW(C$219)+1>COUNT(Tab_IIC_VerwaPer[II-C_Zeile]),\"\",INDEX(F:F,SMALL(Tab_IIC_VerwaPer[II-C_Zeile],1+ROW(F236)-ROW($F$219))))","v":""}]
[91,null,{"$f":"B_II_Verw_Konzept!P2","v":"Strukturen"},{"$f":"B_II_Verw_Konzept!Q2","v":"-"},null,{"$f":"Tab_IIC_VerwaPer[[#This Row],[II-C_Funktionen]]","v":"Strukturen"},"",{"$f":"IF(ROW(C237)-ROW(C$219)+1>COUNT(Tab_IIC_VerwaPer[II-C_Zeile]),\"\",INDEX(F:F,SMALL(Tab_IIC_VerwaPer[II-C_Zeile],1+ROW(F237)-ROW($F$219))))","v":""}]
[92,null,{"$f":"B_II_Verw_Konzept!P3","v":"Infrastruktur_2"},{"$f":"B_II_Verw_Konzept!Q3","v":"-"},null,{"$f":"Tab_IIC_VerwaPer[[#This Row],[II-C_Funktionen]]","v":"Infrastruktur_2"},"",{"$f":"IF(ROW(C238)-ROW(C$219)+1>COUNT(Tab_IIC_VerwaPer[II-C_Zeile]),\"\",INDEX(F:F,SMALL(Tab_IIC_VerwaPer[II-C_Zeile],1+ROW(F238)-ROW($F$219))))","v":""}]
[93,null,{"$f":"B_II_Verw_Konzept!P4","v":"Infrastruktur_3"},{"$f":"B_II_Verw_Konzept!Q4","v":"-"},null,{"$f":"Tab_IIC_VerwaPer[[#This Row],[II-C_Funktionen]]","v":"Infrastruktur_3"},"",{"$f":"IF(ROW(C239)-ROW(C$219)+1>COUNT(Tab_IIC_VerwaPer[II-C_Zeile]),\"\",INDEX(F:F,SMALL(Tab_IIC_VerwaPer[II-C_Zeile],1+ROW(F239)-ROW($F$219))))","v":""}]
[94,null,{"$f":"B_II_Verw_Konzept!P5","v":"Infrastruktur_4"},{"$f":"B_II_Verw_Konzept!Q5","v":"-"},null,{"$f":"Tab_IIC_VerwaPer[[#This Row],[II-C_Funktionen]]","v":"Infrastruktur_4"},"",{"$f":"IF(ROW(C240)-ROW(C$219)+1>COUNT(Tab_IIC_VerwaPer[II-C_Zeile]),\"\",INDEX(F:F,SMALL(Tab_IIC_VerwaPer[II-C_Zeile],1+ROW(F240)-ROW($F$219))))","v":""}]
[95,null,{"$f":"B_II_Verw_Konzept!P6","v":"Infrastruktur_5"},{"$f":"B_II_Verw_Konzept!Q6","v":"-"},null,{"$f":"Tab_IIC_VerwaPer[[#This Row],[II-C_Funktionen]]","v":"Infrastruktur_5"},241,{"$f":"IF(ROW(C241)-ROW(C$219)+1>COUNT(Tab_IIC_VerwaPer[II-C_Zeile]),\"\",INDEX(F:F,SMALL(Tab_IIC_VerwaPer[II-C_Zeile],1+ROW(F241)-ROW($F$219))))","v":""}]
[96,null,{"$f":"B_II_Verw_Konzept!P7","v":"Infrastruktur_6"},{"$f":"B_II_Verw_Konzept!Q7","v":"-"},null,{"$f":"Tab_IIC_VerwaPer[[#This Row],[II-C_Funktionen]]","v":"Infrastruktur_6"},242,{"$f":"IF(ROW(C242)-ROW(C$219)+1>COUNT(Tab_IIC_VerwaPer[II-C_Zeile]),\"\",INDEX(F:F,SMALL(Tab_IIC_VerwaPer[II-C_Zeile],1+ROW(F242)-ROW($F$219))))","v":""}]
[97,null,{"$f":"B_II_Verw_Konzept!P8","v":"Infrastruktur_7"},{"$f":"B_II_Verw_Konzept!Q8","v":"-"},null,{"$f":"Tab_IIC_VerwaPer[[#This Row],[II-C_Funktionen]]","v":"Infrastruktur_7"},243,{"$f":"IF(ROW(C243)-ROW(C$219)+1>COUNT(Tab_IIC_VerwaPer[II-C_Zeile]),\"\",INDEX(F:F,SMALL(Tab_IIC_VerwaPer[II-C_Zeile],1+ROW(F243)-ROW($F$219))))","v":""}]
[98,null,{"$f":"B_II_Verw_Konzept!P9","v":"Infrastruktur_8"},{"$f":"B_II_Verw_Konzept!Q9","v":"-"},null,{"$f":"Tab_IIC_VerwaPer[[#This Row],[II-C_Funktionen]]","v":"Infrastruktur_8"},"",{"$f":"IF(ROW(C244)-ROW(C$219)+1>COUNT(Tab_IIC_VerwaPer[II-C_Zeile]),\"\",INDEX(F:F,SMALL(Tab_IIC_VerwaPer[II-C_Zeile],1+ROW(F244)-ROW($F$219))))","v":""}]
[99,null,{"$f":"B_II_Verw_Konzept!P10","v":"Infrastruktur_9"},{"$f":"B_II_Verw_Konzept!Q10","v":"-"},null,{"$f":"Tab_IIC_VerwaPer[[#This Row],[II-C_Funktionen]]","v":"Infrastruktur_9"},245,{"$f":"IF(ROW(C245)-ROW(C$219)+1>COUNT(Tab_IIC_VerwaPer[II-C_Zeile]),\"\",INDEX(F:F,SMALL(Tab_IIC_VerwaPer[II-C_Zeile],1+ROW(F245)-ROW($F$219))))","v":""}]
[]
["L_Nr.","II. Verwaltungskonzept","II-D_Funktionen","II-D_Werte","II-D_100%","II-D_Funktion","II-D_Zeile","II-D_noch möglich"]
[100,{"$f":"B_II_Verw_Konzept!B6","v":"D. Finanzperspektive"},{"$f":"B_II_Verw_Konzept!L13","v":"BVer1 - Sponsorenanteil am Budget steigt"},{"$f":"B_II_Verw_Konzept!M13","v":"-"},null,{"$f":"Tab_IID_FinanzPer[[#This Row],[II-D_Funktionen]]","v":"BVer1 - Sponsorenanteil am Budget steigt"},{"$f":"IF(COUNTIF($C$42:$C$53,F248)>=1,\"\",ROW())","v":""},{"$f":"IF(ROW(C248)-ROW(C$248)+1>COUNT(Tab_IID_FinanzPer[II-D_Zeile]),\"\",INDEX(F:F,SMALL(Tab_IID_FinanzPer[II-D_Zeile],1+ROW(F248)-ROW($F$248))))","v":"Mitgliedsbeiträge steigen"}]
[101,null,{"$f":"B_II_Verw_Konzept!L14","v":"BVer3 - Zahlungsüberschuss (Cash Flow) steigt"},{"$f":"B_II_Verw_Konzept!M14","v":"-"},null,{"$f":"Tab_IID_FinanzPer[[#This Row],[II-D_Funktionen]]","v":"BVer3 - Zahlungsüberschuss (Cash Flow) steigt"},{"$f":"IF(COUNTIF($C$42:$C$53,F249)>=1,\"\",ROW())","v":""},{"$f":"IF(ROW(C249)-ROW(C$248)+1>COUNT(Tab_IID_FinanzPer[II-D_Zeile]),\"\",INDEX(F:F,SMALL(Tab_IID_FinanzPer[II-D_Zeile],1+ROW(F249)-ROW($F$248))))","v":"Subventionen steigen"}]
[102,null,{"$f":"B_II_Verw_Konzept!L15","v":"Mitgliedsbeiträge steigen"},{"$f":"B_II_Verw_Konzept!M15","v":"-"},null,{"$f":"Tab_IID_FinanzPer[[#This Row],[II-D_Funktionen]]","v":"Mitgliedsbeiträge steigen"},250,{"$f":"IF(ROW(C250)-ROW(C$248)+1>COUNT(Tab_IID_FinanzPer[II-D_Zeile]),\"\",INDEX(F:F,SMALL(Tab_IID_FinanzPer[II-D_Zeile],1+ROW(F250)-ROW($F$248))))","v":"Unterstützer"}]
[103,null,{"$f":"B_II_Verw_Konzept!L16","v":"Subventionen Gemeinde"},{"$f":"B_II_Verw_Konzept!M16","v":"-"},null,{"$f":"Tab_IID_FinanzPer[[#This Row],[II-D_Funktionen]]","v":"Subventionen Gemeinde"},"",{"$f":"IF(ROW(C251)-ROW(C$248)+1>COUNT(Tab_IID_FinanzPer[II-D_Zeile]),\"\",INDEX(F:F,SMALL(Tab_IID_FinanzPer[II-D_Zeile],1+ROW(F251)-ROW($F$248))))","v":"Verkaufserlöse"}]
[104,null,{"$f":"B_II_Verw_Konzept!L17","v":"Sponsoren"},{"$f":"B_II_Verw_Konzept!M17","v":"-"},null,{"$f":"Tab_IID_FinanzPer[[#This Row],[II-D_Funktionen]]","v":"Sponsoren"},"",{"$f":"IF(ROW(C252)-ROW(C$248)+1>COUNT(Tab_IID_FinanzPer[II-D_Zeile]),\"\",INDEX(F:F,SMALL(Tab_IID_FinanzPer[II-D_Zeile],1+ROW(F252)-ROW($F$248))))","v":"Leihgebühren"}]
[105,null,{"$f":"B_II_Verw_Konzept!L18","v":"Partnerschaften"},{"$f":"B_II_Verw_Konzept!M18","v":"-"},null,{"$f":"Tab_IID_FinanzPer[[#This Row],[II-D_Funktionen]]","v":"Partnerschaften"},"",{"$f":"IF(ROW(C253)-ROW(C$248)+1>COUNT(Tab_IID_FinanzPer[II-D_Zeile]),\"\",INDEX(F:F,SMALL(Tab_IID_FinanzPer[II-D_Zeile],1+ROW(F253)-ROW($F$248))))","v":"Vermietungen"}]
[106,null,{"$f":"B_II_Verw_Konzept!L19","v":"Subventionen Verband/Land"},{"$f":"B_II_Verw_Konzept!M19","v":"-"},null,{"$f":"Tab_IID_FinanzPer[[#This Row],[II-D_Funktionen]]","v":"Subventionen Verband/Land"},"",{"$f":"IF(ROW(C254)-ROW(C$248)+1>COUNT(Tab_IID_FinanzPer[II-D_Zeile]),\"\",INDEX(F:F,SMALL(Tab_IID_FinanzPer[II-D_Zeile],1+ROW(F254)-ROW($F$248))))","v":"Spieltagssponsoring"}]
[107,null,{"$f":"B_II_Verw_Konzept!L20","v":"Subventionen steigen"},{"$f":"B_II_Verw_Konzept!M20","v":"-"},null,{"$f":"Tab_IID_FinanzPer[[#This Row],[II-D_Funktionen]]","v":"Subventionen steigen"},255,{"$f":"IF(ROW(C255)-ROW(C$248)+1>COUNT(Tab_IID_FinanzPer[II-D_Zeile]),\"\",INDEX(F:F,SMALL(Tab_IID_FinanzPer[II-D_Zeile],1+ROW(F255)-ROW($F$248))))","v":"Matchballsponsoring"}]
[108,null,{"$f":"B_II_Verw_Konzept!L21","v":"Unterstützer"},{"$f":"B_II_Verw_Konzept!M21","v":"-"},null,{"$f":"Tab_IID_FinanzPer[[#This Row],[II-D_Funktionen]]","v":"Unterstützer"},256,{"$f":"IF(ROW(C256)-ROW(C$248)+1>COUNT(Tab_IID_FinanzPer[II-D_Zeile]),\"\",INDEX(F:F,SMALL(Tab_IID_FinanzPer[II-D_Zeile],1+ROW(F256)-ROW($F$248))))","v":"Werbedurchsagen"}]
[109,null,{"$f":"B_II_Verw_Konzept!N13","v":"BVer2 - Spieltagsumsatz steigt"},{"$f":"B_II_Verw_Konzept!O13","v":"-"},null,{"$f":"Tab_IID_FinanzPer[[#This Row],[II-D_Funktionen]]","v":"BVer2 - Spieltagsumsatz steigt"},"",{"$f":"IF(ROW(C257)-ROW(C$248)+1>COUNT(Tab_IID_FinanzPer[II-D_Zeile]),\"\",INDEX(F:F,SMALL(Tab_IID_FinanzPer[II-D_Zeile],1+ROW(F257)-ROW($F$248))))","v":"Höhere Gewinne bei Veranstaltungen"}]
[110,null,{"$f":"B_II_Verw_Konzept!N14","v":"Transfererlöse steigen"},{"$f":"B_II_Verw_Konzept!O14","v":"-"},null,{"$f":"Tab_IID_FinanzPer[[#This Row],[II-D_Funktionen]]","v":"Transfererlöse steigen"},"",{"$f":"IF(ROW(C258)-ROW(C$248)+1>COUNT(Tab_IID_FinanzPer[II-D_Zeile]),\"\",INDEX(F:F,SMALL(Tab_IID_FinanzPer[II-D_Zeile],1+ROW(F258)-ROW($F$248))))","v":"Sommerfeste"}]
[111,null,{"$f":"B_II_Verw_Konzept!N15","v":"Verkaufserlöse"},{"$f":"B_II_Verw_Konzept!O15","v":"-"},null,{"$f":"Tab_IID_FinanzPer[[#This Row],[II-D_Funktionen]]","v":"Verkaufserlöse"},259,{"$f":"IF(ROW(C259)-ROW(C$248)+1>COUNT(Tab_IID_FinanzPer[II-D_Zeile]),\"\",INDEX(F:F,SMALL(Tab_IID_FinanzPer[II-D_Zeile],1+ROW(F259)-ROW($F$248))))","v":"Winterveranstaltungen"}]
[112,null,{"$f":"B_II_Verw_Konzept!N16","v":"Leihgebühren"},{"$f":"B_II_Verw_Konzept!O16","v":"-"},null,{"$f":"Tab_IID_FinanzPer[[#This Row],[II-D_Funktionen]]","v":"Leihgebühren"},260,{"$f":"IF(ROW(C260)-ROW(C$248)+1>COUNT(Tab_IID_FinanzPer[II-D_Zeile]),\"\",INDEX(F:F,SMALL(Tab_IID_FinanzPer[II-D_Zeile],1+ROW(F260)-ROW($F$248))))","v":"Flohmarkt"}]
[113,null,{"$f":"B_II_Verw_Konzept!N17","v":"Vermietungen"},{"$f":"B_II_Verw_Konzept!O17","v":"-"},null,{"$f":"Tab_IID_FinanzPer[[#This Row],[II-D_Funktionen]]","v":"Vermietungen"},261,{"$f":"IF(ROW(C261)-ROW(C$248)+1>COUNT(Tab_IID_FinanzPer[II-D_Zeile]),\"\",INDEX(F:F,SMALL(Tab_IID_FinanzPer[II-D_Zeile],1+ROW(F261)-ROW($F$248))))","v":"Eisstockturnier"}]
[114,null,{"$f":"B_II_Verw_Konzept!N18","v":"Spieltagssponsoring"},{"$f":"B_II_Verw_Konzept!O18","v":"-"},null,{"$f":"Tab_IID_FinanzPer[[#This Row],[II-D_Funktionen]]","v":"Spieltagssponsoring"},262,{"$f":"IF(ROW(C262)-ROW(C$248)+1>COUNT(Tab_IID_FinanzPer[II-D_Zeile]),\"\",INDEX(F:F,SMALL(Tab_IID_FinanzPer[II-D_Zeile],1+ROW(F262)-ROW($F$248))))","v":"Faschingsumzug"}]
[115,null,{"$f":"B_II_Verw_Konzept!N19","v":"Matchballsponsoring"},{"$f":"B_II_Verw_Konzept!O19","v":"-"},null,{"$f":"Tab_IID_FinanzPer[[#This Row],[II-D_Funktionen]]","v":"Matchballsponsoring"},263,{"$f":"IF(ROW(C263)-ROW(C$248)+1>COUNT(Tab_IID_FinanzPer[II-D_Zeile]),\"\",INDEX(F:F,SMALL(Tab_IID_FinanzPer[II-D_Zeile],1+ROW(F263)-ROW($F$248))))","v":"Stadtfest"}]
[116,null,{"$f":"B_II_Verw_Konzept!N20","v":"Werbedurchsagen"},{"$f":"B_II_Verw_Konzept!O20","v":"-"},null,{"$f":"Tab_IID_FinanzPer[[#This Row],[II-D_Funktionen]]","v":"Werbedurchsagen"},264,{"$f":"IF(ROW(C264)-ROW(C$248)+1>COUNT(Tab_IID_FinanzPer[II-D_Zeile]),\"\",INDEX(F:F,SMALL(Tab_IID_FinanzPer[II-D_Zeile],1+ROW(F264)-ROW($F$248))))","v":"Veranstaltung_9"}]
[117,null,{"$f":"B_II_Verw_Konzept!N21","v":"Fanshop"},{"$f":"B_II_Verw_Konzept!O21","v":"-"},null,{"$f":"Tab_IID_FinanzPer[[#This Row],[II-D_Funktionen]]","v":"Fanshop"},"",{"$f":"IF(ROW(C265)-ROW(C$248)+1>COUNT(Tab_IID_FinanzPer[II-D_Zeile]),\"\",INDEX(F:F,SMALL(Tab_IID_FinanzPer[II-D_Zeile],1+ROW(F265)-ROW($F$248))))","v":"Buffet/Kantine"}]
[118,null,{"$f":"B_II_Verw_Konzept!P13","v":"Höhere Gewinne bei Veranstaltungen"},{"$f":"B_II_Verw_Konzept!Q13","v":"-"},null,{"$f":"Tab_IID_FinanzPer[[#This Row],[II-D_Funktionen]]","v":"Höhere Gewinne bei Veranstaltungen"},266,{"$f":"IF(ROW(C266)-ROW(C$248)+1>COUNT(Tab_IID_FinanzPer[II-D_Zeile]),\"\",INDEX(F:F,SMALL(Tab_IID_FinanzPer[II-D_Zeile],1+ROW(F266)-ROW($F$248))))","v":"Tribüne"}]
[119,null,{"$f":"B_II_Verw_Konzept!P14","v":"Sommerfeste"},{"$f":"B_II_Verw_Konzept!Q14","v":"-"},null,{"$f":"Tab_IID_FinanzPer[[#This Row],[II-D_Funktionen]]","v":"Sommerfeste"},267,{"$f":"IF(ROW(C267)-ROW(C$248)+1>COUNT(Tab_IID_FinanzPer[II-D_Zeile]),\"\",INDEX(F:F,SMALL(Tab_IID_FinanzPer[II-D_Zeile],1+ROW(F267)-ROW($F$248))))","v":"Nachwuchshütte"}]
[120,null,{"$f":"B_II_Verw_Konzept!P15","v":"Winterveranstaltungen"},{"$f":"B_II_Verw_Konzept!Q15","v":"-"},null,{"$f":"Tab_IID_FinanzPer[[#This Row],[II-D_Funktionen]]","v":"Winterveranstaltungen"},268,{"$f":"IF(ROW(C268)-ROW(C$248)+1>COUNT(Tab_IID_FinanzPer[II-D_Zeile]),\"\",INDEX(F:F,SMALL(Tab_IID_FinanzPer[II-D_Zeile],1+ROW(F268)-ROW($F$248))))","v":"Gastronomie_6"}]
[121,null,{"$f":"B_II_Verw_Konzept!P16","v":"Flohmarkt"},{"$f":"B_II_Verw_Konzept!Q16","v":"-"},null,{"$f":"Tab_IID_FinanzPer[[#This Row],[II-D_Funktionen]]","v":"Flohmarkt"},269,{"$f":"IF(ROW(C269)-ROW(C$248)+1>COUNT(Tab_IID_FinanzPer[II-D_Zeile]),\"\",INDEX(F:F,SMALL(Tab_IID_FinanzPer[II-D_Zeile],1+ROW(F269)-ROW($F$248))))","v":"Gastronomie_7"}]
[122,null,{"$f":"B_II_Verw_Konzept!P17","v":"Weihnachtsmarkt"},{"$f":"B_II_Verw_Konzept!Q17","v":"-"},null,{"$f":"Tab_IID_FinanzPer[[#This Row],[II-D_Funktionen]]","v":"Weihnachtsmarkt"},"",{"$f":"IF(ROW(C270)-ROW(C$248)+1>COUNT(Tab_IID_FinanzPer[II-D_Zeile]),\"\",INDEX(F:F,SMALL(Tab_IID_FinanzPer[II-D_Zeile],1+ROW(F270)-ROW($F$248))))","v":"Gastronomie_8"}]
[123,null,{"$f":"B_II_Verw_Konzept!P18","v":"Eisstockturnier"},{"$f":"B_II_Verw_Konzept!Q18","v":"-"},null,{"$f":"Tab_IID_FinanzPer[[#This Row],[II-D_Funktionen]]","v":"Eisstockturnier"},271,{"$f":"IF(ROW(C271)-ROW(C$248)+1>COUNT(Tab_IID_FinanzPer[II-D_Zeile]),\"\",INDEX(F:F,SMALL(Tab_IID_FinanzPer[II-D_Zeile],1+ROW(F271)-ROW($F$248))))","v":"Gastronomie_9"}]
[124,null,{"$f":"B_II_Verw_Konzept!P19","v":"Faschingsumzug"},{"$f":"B_II_Verw_Konzept!Q19","v":"-"},null,{"$f":"Tab_IID_FinanzPer[[#This Row],[II-D_Funktionen]]","v":"Faschingsumzug"},272,{"$f":"IF(ROW(C272)-ROW(C$248)+1>COUNT(Tab_IID_FinanzPer[II-D_Zeile]),\"\",INDEX(F:F,SMALL(Tab_IID_FinanzPer[II-D_Zeile],1+ROW(F272)-ROW($F$248))))","v":""}]
[125,null,{"$f":"B_II_Verw_Konzept!P20","v":"Stadtfest"},{"$f":"B_II_Verw_Konzept!Q20","v":"-"},null,{"$f":"Tab_IID_FinanzPer[[#This Row],[II-D_Funktionen]]","v":"Stadtfest"},273,{"$f":"IF(ROW(C273)-ROW(C$248)+1>COUNT(Tab_IID_FinanzPer[II-D_Zeile]),\"\",INDEX(F:F,SMALL(Tab_IID_FinanzPer[II-D_Zeile],1+ROW(F273)-ROW($F$248))))","v":""}]
[126,null,{"$f":"B_II_Verw_Konzept!P21","v":"Veranstaltung_9"},{"$f":"B_II_Verw_Konzept!Q21","v":"-"},null,{"$f":"Tab_IID_FinanzPer[[#This Row],[II-D_Funktionen]]","v":"Veranstaltung_9"},274,{"$f":"IF(ROW(C274)-ROW(C$248)+1>COUNT(Tab_IID_FinanzPer[II-D_Zeile]),\"\",INDEX(F:F,SMALL(Tab_IID_FinanzPer[II-D_Zeile],1+ROW(F274)-ROW($F$248))))","v":""}]
[127,null,{"$f":"B_II_Verw_Konzept!R13","v":"Buffet/Kantine"},{"$f":"B_II_Verw_Konzept!S13","v":"-"},null,{"$f":"Tab_IID_FinanzPer[[#This Row],[II-D_Funktionen]]","v":"Buffet/Kantine"},275,{"$f":"IF(ROW(C275)-ROW(C$248)+1>COUNT(Tab_IID_FinanzPer[II-D_Zeile]),\"\",INDEX(F:F,SMALL(Tab_IID_FinanzPer[II-D_Zeile],1+ROW(F275)-ROW($F$248))))","v":""}]
[128,null,{"$f":"B_II_Verw_Konzept!R14","v":"Tribüne"},{"$f":"B_II_Verw_Konzept!S14","v":"-"},null,{"$f":"Tab_IID_FinanzPer[[#This Row],[II-D_Funktionen]]","v":"Tribüne"},276,{"$f":"IF(ROW(C276)-ROW(C$248)+1>COUNT(Tab_IID_FinanzPer[II-D_Zeile]),\"\",INDEX(F:F,SMALL(Tab_IID_FinanzPer[II-D_Zeile],1+ROW(F276)-ROW($F$248))))","v":""}]
[129,null,{"$f":"B_II_Verw_Konzept!R15","v":"Hütten"},{"$f":"B_II_Verw_Konzept!S15","v":"-"},null,{"$f":"Tab_IID_FinanzPer[[#This Row],[II-D_Funktionen]]","v":"Hütten"},"",{"$f":"IF(ROW(C277)-ROW(C$248)+1>COUNT(Tab_IID_FinanzPer[II-D_Zeile]),\"\",INDEX(F:F,SMALL(Tab_IID_FinanzPer[II-D_Zeile],1+ROW(F277)-ROW($F$248))))","v":""}]
[130,null,{"$f":"B_II_Verw_Konzept!R16","v":"Nachwuchshütte"},{"$f":"B_II_Verw_Konzept!S16","v":"-"},null,{"$f":"Tab_IID_FinanzPer[[#This Row],[II-D_Funktionen]]","v":"Nachwuchshütte"},278,{"$f":"IF(ROW(C278)-ROW(C$248)+1>COUNT(Tab_IID_FinanzPer[II-D_Zeile]),\"\",INDEX(F:F,SMALL(Tab_IID_FinanzPer[II-D_Zeile],1+ROW(F278)-ROW($F$248))))","v":""}]
[131,null,{"$f":"B_II_Verw_Konzept!R17","v":"Sonstige"},{"$f":"B_II_Verw_Konzept!S17","v":"-"},null,{"$f":"Tab_IID_FinanzPer[[#This Row],[II-D_Funktionen]]","v":"Sonstige"},"",{"$f":"IF(ROW(C279)-ROW(C$248)+1>COUNT(Tab_IID_FinanzPer[II-D_Zeile]),\"\",INDEX(F:F,SMALL(Tab_IID_FinanzPer[II-D_Zeile],1+ROW(F279)-ROW($F$248))))","v":""}]
[132,null,{"$f":"B_II_Verw_Konzept!R18","v":"Gastronomie_6"},{"$f":"B_II_Verw_Konzept!S18","v":"-"},null,{"$f":"Tab_IID_FinanzPer[[#This Row],[II-D_Funktionen]]","v":"Gastronomie_6"},280,{"$f":"IF(ROW(C280)-ROW(C$248)+1>COUNT(Tab_IID_FinanzPer[II-D_Zeile]),\"\",INDEX(F:F,SMALL(Tab_IID_FinanzPer[II-D_Zeile],1+ROW(F280)-ROW($F$248))))","v":""}]
[133,null,{"$f":"B_II_Verw_Konzept!R19","v":"Gastronomie_7"},{"$f":"B_II_Verw_Konzept!S19","v":"-"},null,{"$f":"Tab_IID_FinanzPer[[#This Row],[II-D_Funktionen]]","v":"Gastronomie_7"},281,{"$f":"IF(ROW(C281)-ROW(C$248)+1>COUNT(Tab_IID_FinanzPer[II-D_Zeile]),\"\",INDEX(F:F,SMALL(Tab_IID_FinanzPer[II-D_Zeile],1+ROW(F281)-ROW($F$248))))","v":""}]
[134,null,{"$f":"B_II_Verw_Konzept!R20","v":"Gastronomie_8"},{"$f":"B_II_Verw_Konzept!S20","v":"-"},null,{"$f":"Tab_IID_FinanzPer[[#This Row],[II-D_Funktionen]]","v":"Gastronomie_8"},282,{"$f":"IF(ROW(C282)-ROW(C$248)+1>COUNT(Tab_IID_FinanzPer[II-D_Zeile]),\"\",INDEX(F:F,SMALL(Tab_IID_FinanzPer[II-D_Zeile],1+ROW(F282)-ROW($F$248))))","v":""}]
[135,null,{"$f":"B_II_Verw_Konzept!R21","v":"Gastronomie_9"},{"$f":"B_II_Verw_Konzept!S21","v":"-"},null,{"$f":"Tab_IID_FinanzPer[[#This Row],[II-D_Funktionen]]","v":"Gastronomie_9"},283,{"$f":"IF(ROW(C283)-ROW(C$248)+1>COUNT(Tab_IID_FinanzPer[II-D_Zeile]),\"\",INDEX(F:F,SMALL(Tab_IID_FinanzPer[II-D_Zeile],1+ROW(F283)-ROW($F$248))))","v":""}]
[]
["L_Nr.","III. Sportkonzept","III-E_Funktionen","III-E_Werte","III-E_100%","III-E_Funktion","III-E_Zeile","III-E_noch möglich"]
[136,{"$f":"B_III_Sport_Konzept!$B$5","v":"E. Visionsperspektive"},{"$f":"B_III_Sport_Konzept!L2","v":"Vereinsvision"},{"$f":"B_III_Sport_Konzept!M2","v":"-"},null,{"$f":"Tab_IIIE_VisionsPer[[#This Row],[III-E_Funktionen]]","v":"Vereinsvision"},{"$f":"IF(COUNTIF($C$55:$C$66,F286)>=1,\"\",ROW())","v":286},{"$f":"IF(ROW(C286)-ROW(C$286)+1>COUNT(Tab_IIIE_VisionsPer[III-E_Zeile]),\"\",INDEX(F:F,SMALL(Tab_IIIE_VisionsPer[III-E_Zeile],1+ROW(F286)-ROW($F$286))))","v":"Vereinsvision"}]
[137,null,{"$f":"B_III_Sport_Konzept!L3","v":"Sportliche Vereinsvisionen"},{"$f":"B_III_Sport_Konzept!M3","v":"-"},null,{"$f":"Tab_IIIE_VisionsPer[[#This Row],[III-E_Funktionen]]","v":"Sportliche Vereinsvisionen"},{"$f":"IF(COUNTIF($C$55:$C$66,F287)>=1,\"\",ROW())","v":""},{"$f":"IF(ROW(C287)-ROW(C$286)+1>COUNT(Tab_IIIE_VisionsPer[III-E_Zeile]),\"\",INDEX(F:F,SMALL(Tab_IIIE_VisionsPer[III-E_Zeile],1+ROW(F287)-ROW($F$286))))","v":"Therapievisionen"}]
[138,null,{"$f":"B_III_Sport_Konzept!L4","v":"Tugenden/Motivation"},{"$f":"B_III_Sport_Konzept!M4","v":"-"},null,{"$f":"Tab_IIIE_VisionsPer[[#This Row],[III-E_Funktionen]]","v":"Tugenden/Motivation"},"",{"$f":"IF(ROW(C288)-ROW(C$286)+1>COUNT(Tab_IIIE_VisionsPer[III-E_Zeile]),\"\",INDEX(F:F,SMALL(Tab_IIIE_VisionsPer[III-E_Zeile],1+ROW(F288)-ROW($F$286))))","v":"Medizinische Abteilung"}]
[139,null,{"$f":"B_III_Sport_Konzept!L5","v":"Spielsystemvision"},{"$f":"B_III_Sport_Konzept!M5","v":"-"},null,{"$f":"Tab_IIIE_VisionsPer[[#This Row],[III-E_Funktionen]]","v":"Spielsystemvision"},"",{"$f":"IF(ROW(C289)-ROW(C$286)+1>COUNT(Tab_IIIE_VisionsPer[III-E_Zeile]),\"\",INDEX(F:F,SMALL(Tab_IIIE_VisionsPer[III-E_Zeile],1+ROW(F289)-ROW($F$286))))","v":"Mentaltrainer"}]
[140,null,{"$f":"B_III_Sport_Konzept!L6","v":"Scoutingvision"},{"$f":"B_III_Sport_Konzept!M6","v":"-"},null,{"$f":"Tab_IIIE_VisionsPer[[#This Row],[III-E_Funktionen]]","v":"Scoutingvision"},"",{"$f":"IF(ROW(C290)-ROW(C$286)+1>COUNT(Tab_IIIE_VisionsPer[III-E_Zeile]),\"\",INDEX(F:F,SMALL(Tab_IIIE_VisionsPer[III-E_Zeile],1+ROW(F290)-ROW($F$286))))","v":"Spielsystemvision_8"}]
[141,null,{"$f":"B_III_Sport_Konzept!L7","v":"Analysevision"},{"$f":"B_III_Sport_Konzept!M7","v":"-"},null,{"$f":"Tab_IIIE_VisionsPer[[#This Row],[III-E_Funktionen]]","v":"Analysevision"},"",{"$f":"IF(ROW(C291)-ROW(C$286)+1>COUNT(Tab_IIIE_VisionsPer[III-E_Zeile]),\"\",INDEX(F:F,SMALL(Tab_IIIE_VisionsPer[III-E_Zeile],1+ROW(F291)-ROW($F$286))))","v":"Spielphasen Visionen"}]
[142,null,{"$f":"B_III_Sport_Konzept!L8","v":"Therapievisionen"},{"$f":"B_III_Sport_Konzept!M8","v":"-"},null,{"$f":"Tab_IIIE_VisionsPer[[#This Row],[III-E_Funktionen]]","v":"Therapievisionen"},292,{"$f":"IF(ROW(C292)-ROW(C$286)+1>COUNT(Tab_IIIE_VisionsPer[III-E_Zeile]),\"\",INDEX(F:F,SMALL(Tab_IIIE_VisionsPer[III-E_Zeile],1+ROW(F292)-ROW($F$286))))","v":"Spielphasen Visionen"}]
[143,null,{"$f":"B_III_Sport_Konzept!L9","v":"Medizinische Abteilung"},{"$f":"B_III_Sport_Konzept!M9","v":"-"},null,{"$f":"Tab_IIIE_VisionsPer[[#This Row],[III-E_Funktionen]]","v":"Medizinische Abteilung"},293,{"$f":"IF(ROW(C293)-ROW(C$286)+1>COUNT(Tab_IIIE_VisionsPer[III-E_Zeile]),\"\",INDEX(F:F,SMALL(Tab_IIIE_VisionsPer[III-E_Zeile],1+ROW(F293)-ROW($F$286))))","v":""}]
[144,null,{"$f":"B_III_Sport_Konzept!L10","v":"Mentaltrainer"},{"$f":"B_III_Sport_Konzept!M10","v":"-"},null,{"$f":"Tab_IIIE_VisionsPer[[#This Row],[III-E_Funktionen]]","v":"Mentaltrainer"},294,{"$f":"IF(ROW(C294)-ROW(C$286)+1>COUNT(Tab_IIIE_VisionsPer[III-E_Zeile]),\"\",INDEX(F:F,SMALL(Tab_IIIE_VisionsPer[III-E_Zeile],1+ROW(F294)-ROW($F$286))))","v":""}]
[145,null,{"$f":"B_III_Sport_Konzept!N2","v":"Tugenden/Motivation"},{"$f":"B_III_Sport_Konzept!O2","v":"-"},null,{"$f":"Tab_IIIE_VisionsPer[[#This Row],[III-E_Funktionen]]","v":"Tugenden/Motivation"},"",{"$f":"IF(ROW(C295)-ROW(C$286)+1>COUNT(Tab_IIIE_VisionsPer[III-E_Zeile]),\"\",INDEX(F:F,SMALL(Tab_IIIE_VisionsPer[III-E_Zeile],1+ROW(F295)-ROW($F$286))))","v":""}]
[146,null,{"$f":"B_III_Sport_Konzept!N3","v":"Spielsystemvision"},{"$f":"B_III_Sport_Konzept!O3","v":"-"},null,{"$f":"Tab_IIIE_VisionsPer[[#This Row],[III-E_Funktionen]]","v":"Spielsystemvision"},"",{"$f":"IF(ROW(C296)-ROW(C$286)+1>COUNT(Tab_IIIE_VisionsPer[III-E_Zeile]),\"\",INDEX(F:F,SMALL(Tab_IIIE_VisionsPer[III-E_Zeile],1+ROW(F296)-ROW($F$286))))","v":""}]
[147,null,{"$f":"B_III_Sport_Konzept!N4","v":"Spielvision"},{"$f":"B_III_Sport_Konzept!O4","v":"-"},null,{"$f":"Tab_IIIE_VisionsPer[[#This Row],[III-E_Funktionen]]","v":"Spielvision"},"",{"$f":"IF(ROW(C297)-ROW(C$286)+1>COUNT(Tab_IIIE_VisionsPer[III-E_Zeile]),\"\",INDEX(F:F,SMALL(Tab_IIIE_VisionsPer[III-E_Zeile],1+ROW(F297)-ROW($F$286))))","v":""}]
[148,null,{"$f":"B_III_Sport_Konzept!N5","v":"Ausbildungsvision"},{"$f":"B_III_Sport_Konzept!O5","v":"-"},null,{"$f":"Tab_IIIE_VisionsPer[[#This Row],[III-E_Funktionen]]","v":"Ausbildungsvision"},"",{"$f":"IF(ROW(C298)-ROW(C$286)+1>COUNT(Tab_IIIE_VisionsPer[III-E_Zeile]),\"\",INDEX(F:F,SMALL(Tab_IIIE_VisionsPer[III-E_Zeile],1+ROW(F298)-ROW($F$286))))","v":""}]
[149,null,{"$f":"B_III_Sport_Konzept!N6","v":"Trainingsvision"},{"$f":"B_III_Sport_Konzept!O6","v":"-"},null,{"$f":"Tab_IIIE_VisionsPer[[#This Row],[III-E_Funktionen]]","v":"Trainingsvision"},"",{"$f":"IF(ROW(C299)-ROW(C$286)+1>COUNT(Tab_IIIE_VisionsPer[III-E_Zeile]),\"\",INDEX(F:F,SMALL(Tab_IIIE_VisionsPer[III-E_Zeile],1+ROW(F299)-ROW($F$286))))","v":""}]
[150,null,{"$f":"B_III_Sport_Konzept!N7","v":"Scoutingvision"},{"$f":"B_III_Sport_Konzept!O7","v":"-"},null,{"$f":"Tab_IIIE_VisionsPer[[#This Row],[III-E_Funktionen]]","v":"Scoutingvision"},"",{"$f":"IF(ROW(C300)-ROW(C$286)+1>COUNT(Tab_IIIE_VisionsPer[III-E_Zeile]),\"\",INDEX(F:F,SMALL(Tab_IIIE_VisionsPer[III-E_Zeile],1+ROW(F300)-ROW($F$286))))","v":""}]
[151,null,{"$f":"B_III_Sport_Konzept!N8","v":"Analysevision"},{"$f":"B_III_Sport_Konzept!O8","v":"-"},null,{"$f":"Tab_IIIE_VisionsPer[[#This Row],[III-E_Funktionen]]","v":"Analysevision"},"",{"$f":"IF(ROW(C301)-ROW(C$286)+1>COUNT(Tab_IIIE_VisionsPer[III-E_Zeile]),\"\",INDEX(F:F,SMALL(Tab_IIIE_VisionsPer[III-E_Zeile],1+ROW(F301)-ROW($F$286))))","v":""}]
[152,null,{"$f":"B_III_Sport_Konzept!N9","v":"Spielsystemvision_8"},{"$f":"B_III_Sport_Konzept!O9","v":"-"},null,{"$f":"Tab_IIIE_VisionsPer[[#This Row],[III-E_Funktionen]]","v":"Spielsystemvision_8"},302,{"$f":"IF(ROW(C302)-ROW(C$286)+1>COUNT(Tab_IIIE_VisionsPer[III-E_Zeile]),\"\",INDEX(F:F,SMALL(Tab_IIIE_VisionsPer[III-E_Zeile],1+ROW(F302)-ROW($F$286))))","v":""}]
[153,null,{"$f":"B_III_Sport_Konzept!N10","v":"Spielsystemvision_9"},{"$f":"B_III_Sport_Konzept!O10","v":"-"},null,{"$f":"Tab_IIIE_VisionsPer[[#This Row],[III-E_Funktionen]]","v":"Spielsystemvision_9"},"",{"$f":"IF(ROW(C303)-ROW(C$286)+1>COUNT(Tab_IIIE_VisionsPer[III-E_Zeile]),\"\",INDEX(F:F,SMALL(Tab_IIIE_VisionsPer[III-E_Zeile],1+ROW(F303)-ROW($F$286))))","v":""}]
[154,null,{"$f":"B_III_Sport_Konzept!P2","v":"Tugenden/Motivation"},{"$f":"B_III_Sport_Konzept!Q2","v":"-"},null,{"$f":"Tab_IIIE_VisionsPer[[#This Row],[III-E_Funktionen]]","v":"Tugenden/Motivation"},"",{"$f":"IF(ROW(C304)-ROW(C$286)+1>COUNT(Tab_IIIE_VisionsPer[III-E_Zeile]),\"\",INDEX(F:F,SMALL(Tab_IIIE_VisionsPer[III-E_Zeile],1+ROW(F304)-ROW($F$286))))","v":""}]
[155,null,{"$f":"B_III_Sport_Konzept!P3","v":"Spielvision"},{"$f":"B_III_Sport_Konzept!Q3","v":"-"},null,{"$f":"Tab_IIIE_VisionsPer[[#This Row],[III-E_Funktionen]]","v":"Spielvision"},"",{"$f":"IF(ROW(C305)-ROW(C$286)+1>COUNT(Tab_IIIE_VisionsPer[III-E_Zeile]),\"\",INDEX(F:F,SMALL(Tab_IIIE_VisionsPer[III-E_Zeile],1+ROW(F305)-ROW($F$286))))","v":""}]
[156,null,{"$f":"B_III_Sport_Konzept!P4","v":"Ausbildungsvision"},{"$f":"B_III_Sport_Konzept!Q4","v":"-"},null,{"$f":"Tab_IIIE_VisionsPer[[#This Row],[III-E_Funktionen]]","v":"Ausbildungsvision"},"",{"$f":"IF(ROW(C306)-ROW(C$286)+1>COUNT(Tab_IIIE_VisionsPer[III-E_Zeile]),\"\",INDEX(F:F,SMALL(Tab_IIIE_VisionsPer[III-E_Zeile],1+ROW(F306)-ROW($F$286))))","v":""}]
[157,null,{"$f":"B_III_Sport_Konzept!P5","v":"Trainingsvision"},{"$f":"B_III_Sport_Konzept!Q5","v":"-"},null,{"$f":"Tab_IIIE_VisionsPer[[#This Row],[III-E_Funktionen]]","v":"Trainingsvision"},"",{"$f":"IF(ROW(C307)-ROW(C$286)+1>COUNT(Tab_IIIE_VisionsPer[III-E_Zeile]),\"\",INDEX(F:F,SMALL(Tab_IIIE_VisionsPer[III-E_Zeile],1+ROW(F307)-ROW($F$286))))","v":""}]
[158,null,{"$f":"B_III_Sport_Konzept!P6","v":"Scoutingvision"},{"$f":"B_III_Sport_Konzept!Q6","v":"-"},null,{"$f":"Tab_IIIE_VisionsPer[[#This Row],[III-E_Funktionen]]","v":"Scoutingvision"},"",{"$f":"IF(ROW(C308)-ROW(C$286)+1>COUNT(Tab_IIIE_VisionsPer[III-E_Zeile]),\"\",INDEX(F:F,SMALL(Tab_IIIE_VisionsPer[III-E_Zeile],1+ROW(F308)-ROW($F$286))))","v":""}]
[159,null,{"$f":"B_III_Sport_Konzept!P7","v":"Analysevision"},{"$f":"B_III_Sport_Konzept!Q7","v":"-"},null,{"$f":"Tab_IIIE_VisionsPer[[#This Row],[III-E_Funktionen]]","v":"Analysevision"},"",{"$f":"IF(ROW(C309)-ROW(C$286)+1>COUNT(Tab_IIIE_VisionsPer[III-E_Zeile]),\"\",INDEX(F:F,SMALL(Tab_IIIE_VisionsPer[III-E_Zeile],1+ROW(F309)-ROW($F$286))))","v":""}]
[160,null,{"$f":"B_III_Sport_Konzept!P8","v":"Spieltaktische Visionen"},{"$f":"B_III_Sport_Konzept!Q8","v":"-"},null,{"$f":"Tab_IIIE_VisionsPer[[#This Row],[III-E_Funktionen]]","v":"Spieltaktische Visionen"},"",{"$f":"IF(ROW(C310)-ROW(C$286)+1>COUNT(Tab_IIIE_VisionsPer[III-E_Zeile]),\"\",INDEX(F:F,SMALL(Tab_IIIE_VisionsPer[III-E_Zeile],1+ROW(F310)-ROW($F$286))))","v":""}]
[161,null,{"$f":"B_III_Sport_Konzept!P9","v":"Spielphasen Visionen"},{"$f":"B_III_Sport_Konzept!Q9","v":"-"},null,{"$f":"Tab_IIIE_VisionsPer[[#This Row],[III-E_Funktionen]]","v":"Spielphasen Visionen"},311,{"$f":"IF(ROW(C311)-ROW(C$286)+1>COUNT(Tab_IIIE_VisionsPer[III-E_Zeile]),\"\",INDEX(F:F,SMALL(Tab_IIIE_VisionsPer[III-E_Zeile],1+ROW(F311)-ROW($F$286))))","v":""}]
[162,null,{"$f":"B_III_Sport_Konzept!P10","v":"Sport-Spielvisionen KM_9"},{"$f":"B_III_Sport_Konzept!Q10","v":"-"},null,{"$f":"Tab_IIIE_VisionsPer[[#This Row],[III-E_Funktionen]]","v":"Sport-Spielvisionen KM_9"},"",{"$f":"IF(ROW(C312)-ROW(C$286)+1>COUNT(Tab_IIIE_VisionsPer[III-E_Zeile]),\"\",INDEX(F:F,SMALL(Tab_IIIE_VisionsPer[III-E_Zeile],1+ROW(F312)-ROW($F$286))))","v":""}]
[163,null,{"$f":"B_III_Sport_Konzept!R2","v":"Tugenden/Motivation"},{"$f":"B_III_Sport_Konzept!S2","v":"-"},null,{"$f":"Tab_IIIE_VisionsPer[[#This Row],[III-E_Funktionen]]","v":"Tugenden/Motivation"},"",{"$f":"IF(ROW(C313)-ROW(C$286)+1>COUNT(Tab_IIIE_VisionsPer[III-E_Zeile]),\"\",INDEX(F:F,SMALL(Tab_IIIE_VisionsPer[III-E_Zeile],1+ROW(F313)-ROW($F$286))))","v":""}]
[164,null,{"$f":"B_III_Sport_Konzept!R3","v":"Spielvision"},{"$f":"B_III_Sport_Konzept!S3","v":"-"},null,{"$f":"Tab_IIIE_VisionsPer[[#This Row],[III-E_Funktionen]]","v":"Spielvision"},"",{"$f":"IF(ROW(C314)-ROW(C$286)+1>COUNT(Tab_IIIE_VisionsPer[III-E_Zeile]),\"\",INDEX(F:F,SMALL(Tab_IIIE_VisionsPer[III-E_Zeile],1+ROW(F314)-ROW($F$286))))","v":""}]
[165,null,{"$f":"B_III_Sport_Konzept!R4","v":"Ausbildungsvision"},{"$f":"B_III_Sport_Konzept!S4","v":"-"},null,{"$f":"Tab_IIIE_VisionsPer[[#This Row],[III-E_Funktionen]]","v":"Ausbildungsvision"},"",{"$f":"IF(ROW(C315)-ROW(C$286)+1>COUNT(Tab_IIIE_VisionsPer[III-E_Zeile]),\"\",INDEX(F:F,SMALL(Tab_IIIE_VisionsPer[III-E_Zeile],1+ROW(F315)-ROW($F$286))))","v":""}]
[166,null,{"$f":"B_III_Sport_Konzept!R5","v":"Trainingsvision"},{"$f":"B_III_Sport_Konzept!S5","v":"-"},null,{"$f":"Tab_IIIE_VisionsPer[[#This Row],[III-E_Funktionen]]","v":"Trainingsvision"},"",{"$f":"IF(ROW(C316)-ROW(C$286)+1>COUNT(Tab_IIIE_VisionsPer[III-E_Zeile]),\"\",INDEX(F:F,SMALL(Tab_IIIE_VisionsPer[III-E_Zeile],1+ROW(F316)-ROW($F$286))))","v":""}]
[167,null,{"$f":"B_III_Sport_Konzept!R6","v":"Scoutingvision"},{"$f":"B_III_Sport_Konzept!S6","v":"-"},null,{"$f":"Tab_IIIE_VisionsPer[[#This Row],[III-E_Funktionen]]","v":"Scoutingvision"},"",{"$f":"IF(ROW(C317)-ROW(C$286)+1>COUNT(Tab_IIIE_VisionsPer[III-E_Zeile]),\"\",INDEX(F:F,SMALL(Tab_IIIE_VisionsPer[III-E_Zeile],1+ROW(F317)-ROW($F$286))))","v":""}]
[168,null,{"$f":"B_III_Sport_Konzept!R7","v":"Analysevision"},{"$f":"B_III_Sport_Konzept!S7","v":"-"},null,{"$f":"Tab_IIIE_VisionsPer[[#This Row],[III-E_Funktionen]]","v":"Analysevision"},"",{"$f":"IF(ROW(C318)-ROW(C$286)+1>COUNT(Tab_IIIE_VisionsPer[III-E_Zeile]),\"\",INDEX(F:F,SMALL(Tab_IIIE_VisionsPer[III-E_Zeile],1+ROW(F318)-ROW($F$286))))","v":""}]
[169,null,{"$f":"B_III_Sport_Konzept!R8","v":"Spieltaktische Visionen"},{"$f":"B_III_Sport_Konzept!S8","v":"-"},null,{"$f":"Tab_IIIE_VisionsPer[[#This Row],[III-E_Funktionen]]","v":"Spieltaktische Visionen"},"",{"$f":"IF(ROW(C319)-ROW(C$286)+1>COUNT(Tab_IIIE_VisionsPer[III-E_Zeile]),\"\",INDEX(F:F,SMALL(Tab_IIIE_VisionsPer[III-E_Zeile],1+ROW(F319)-ROW($F$286))))","v":""}]
[170,null,{"$f":"B_III_Sport_Konzept!R9","v":"Spielphasen Visionen"},{"$f":"B_III_Sport_Konzept!S9","v":"-"},null,{"$f":"Tab_IIIE_VisionsPer[[#This Row],[III-E_Funktionen]]","v":"Spielphasen Visionen"},320,{"$f":"IF(ROW(C320)-ROW(C$286)+1>COUNT(Tab_IIIE_VisionsPer[III-E_Zeile]),\"\",INDEX(F:F,SMALL(Tab_IIIE_VisionsPer[III-E_Zeile],1+ROW(F320)-ROW($F$286))))","v":""}]
[171,null,{"$f":"B_III_Sport_Konzept!R10","v":"Entwicklungsvisionen"},{"$f":"B_III_Sport_Konzept!S10","v":"-"},null,{"$f":"Tab_IIIE_VisionsPer[[#This Row],[III-E_Funktionen]]","v":"Entwicklungsvisionen"},"",{"$f":"IF(ROW(C321)-ROW(C$286)+1>COUNT(Tab_IIIE_VisionsPer[III-E_Zeile]),\"\",INDEX(F:F,SMALL(Tab_IIIE_VisionsPer[III-E_Zeile],1+ROW(F321)-ROW($F$286))))","v":""}]
[]
["L_Nr.","III. Sportkonzept","III-F_Funktionen","III-F_Werte","III-F_100%","III-F_Funktion","III-F_Zeile","III-F_noch möglich"]
[172,{"$f":"B_III_Sport_Konzept!$B$6","v":"F. Sportperspektive"},{"$f":"B_III_Sport_Konzept!$L13","v":"BSpo1 - Ausbildungsstand der Trainer erhöhen"},{"$f":"B_III_Sport_Konzept!M13","v":"-"},null,{"$f":"Tab_IIIF_SportPer[[#This Row],[III-F_Funktionen]]","v":"BSpo1 - Ausbildungsstand der Trainer erhöhen"},{"$f":"IF(COUNTIF($C$67:$C$78,F324)>=1,\"\",ROW())","v":""},{"$f":"IF(ROW(C324)-ROW(C$324)+1>COUNT(Tab_IIIF_SportPer[III-F_Zeile]),\"\",INDEX(F:F,SMALL(Tab_IIIF_SportPer[III-F_Zeile],1+ROW(F286)-ROW($F$286))))","v":"Qualität der KM Spieler wird erhöht"}]
[173,null,{"$f":"B_III_Sport_Konzept!$L14","v":"BSpo2 - Quantität der NW-Spieler wird erhöht"},{"$f":"B_III_Sport_Konzept!M14","v":"-"},null,{"$f":"Tab_IIIF_SportPer[[#This Row],[III-F_Funktionen]]","v":"BSpo2 - Quantität der NW-Spieler wird erhöht"},{"$f":"IF(COUNTIF($C$67:$C$78,F325)>=1,\"\",ROW())","v":""},{"$f":"IF(ROW(C325)-ROW(C$324)+1>COUNT(Tab_IIIF_SportPer[III-F_Zeile]),\"\",INDEX(F:F,SMALL(Tab_IIIF_SportPer[III-F_Zeile],1+ROW(F287)-ROW($F$286))))","v":"Passenden Trainer finden oder entwickeln"}]
[174,null,{"$f":"B_III_Sport_Konzept!$L15","v":"BSpo3 - Anteil der Eigenbauspieler in KM steigt"},{"$f":"B_III_Sport_Konzept!M15","v":"-"},null,{"$f":"Tab_IIIF_SportPer[[#This Row],[III-F_Funktionen]]","v":"BSpo3 - Anteil der Eigenbauspieler in KM steigt"},"",{"$f":"IF(ROW(C326)-ROW(C$324)+1>COUNT(Tab_IIIF_SportPer[III-F_Zeile]),\"\",INDEX(F:F,SMALL(Tab_IIIF_SportPer[III-F_Zeile],1+ROW(F288)-ROW($F$286))))","v":"System-Auffassung_2"}]
[175,null,{"$f":"B_III_Sport_Konzept!$L16","v":"BSpo4 - Sportlicher Erfolg der KM steigt"},{"$f":"B_III_Sport_Konzept!M16","v":"-"},null,{"$f":"Tab_IIIF_SportPer[[#This Row],[III-F_Funktionen]]","v":"BSpo4 - Sportlicher Erfolg der KM steigt"},"",{"$f":"IF(ROW(C327)-ROW(C$324)+1>COUNT(Tab_IIIF_SportPer[III-F_Zeile]),\"\",INDEX(F:F,SMALL(Tab_IIIF_SportPer[III-F_Zeile],1+ROW(F289)-ROW($F$286))))","v":"System-Auffassung_3"}]
[176,null,{"$f":"B_III_Sport_Konzept!$L17","v":"Leitsätze"},{"$f":"B_III_Sport_Konzept!M17","v":"-"},null,{"$f":"Tab_IIIF_SportPer[[#This Row],[III-F_Funktionen]]","v":"Leitsätze"},"",{"$f":"IF(ROW(C328)-ROW(C$324)+1>COUNT(Tab_IIIF_SportPer[III-F_Zeile]),\"\",INDEX(F:F,SMALL(Tab_IIIF_SportPer[III-F_Zeile],1+ROW(F290)-ROW($F$286))))","v":"System-Auffassung_4"}]
[177,null,{"$f":"B_III_Sport_Konzept!$L18","v":"Qualität der NW wird erhöht"},{"$f":"B_III_Sport_Konzept!M18","v":"-"},null,{"$f":"Tab_IIIF_SportPer[[#This Row],[III-F_Funktionen]]","v":"Qualität der NW wird erhöht"},"",{"$f":"IF(ROW(C329)-ROW(C$324)+1>COUNT(Tab_IIIF_SportPer[III-F_Zeile]),\"\",INDEX(F:F,SMALL(Tab_IIIF_SportPer[III-F_Zeile],1+ROW(F291)-ROW($F$286))))","v":"System-Auffassung_5"}]
[178,null,{"$f":"B_III_Sport_Konzept!$L19","v":"Qualität der KM Spieler wird erhöht"},{"$f":"B_III_Sport_Konzept!M19","v":"-"},null,{"$f":"Tab_IIIF_SportPer[[#This Row],[III-F_Funktionen]]","v":"Qualität der KM Spieler wird erhöht"},330,{"$f":"IF(ROW(C330)-ROW(C$324)+1>COUNT(Tab_IIIF_SportPer[III-F_Zeile]),\"\",INDEX(F:F,SMALL(Tab_IIIF_SportPer[III-F_Zeile],1+ROW(F292)-ROW($F$286))))","v":"System-Auffassung_6"}]
[179,null,{"$f":"B_III_Sport_Konzept!$L20","v":"Interesse externer Spieler steigt"},{"$f":"B_III_Sport_Konzept!M20","v":"-"},null,{"$f":"Tab_IIIF_SportPer[[#This Row],[III-F_Funktionen]]","v":"Interesse externer Spieler steigt"},"",{"$f":"IF(ROW(C331)-ROW(C$324)+1>COUNT(Tab_IIIF_SportPer[III-F_Zeile]),\"\",INDEX(F:F,SMALL(Tab_IIIF_SportPer[III-F_Zeile],1+ROW(F293)-ROW($F$286))))","v":"System-Auffassung_7"}]
[180,null,{"$f":"B_III_Sport_Konzept!$L21","v":"Passenden Trainer finden oder entwickeln"},{"$f":"B_III_Sport_Konzept!M21","v":"-"},null,{"$f":"Tab_IIIF_SportPer[[#This Row],[III-F_Funktionen]]","v":"Passenden Trainer finden oder entwickeln"},332,{"$f":"IF(ROW(C332)-ROW(C$324)+1>COUNT(Tab_IIIF_SportPer[III-F_Zeile]),\"\",INDEX(F:F,SMALL(Tab_IIIF_SportPer[III-F_Zeile],1+ROW(F294)-ROW($F$286))))","v":"System-Auffassung_8"}]
[181,null,{"$f":"B_III_Sport_Konzept!$N13","v":"System-Auffassung"},{"$f":"B_III_Sport_Konzept!O13","v":"-"},null,{"$f":"Tab_IIIF_SportPer[[#This Row],[III-F_Funktionen]]","v":"System-Auffassung"},"",{"$f":"IF(ROW(C333)-ROW(C$324)+1>COUNT(Tab_IIIF_SportPer[III-F_Zeile]),\"\",INDEX(F:F,SMALL(Tab_IIIF_SportPer[III-F_Zeile],1+ROW(F295)-ROW($F$286))))","v":"System-Auffassung_9"}]
[182,null,{"$f":"B_III_Sport_Konzept!$N14","v":"System-Auffassung_2"},{"$f":"B_III_Sport_Konzept!O14","v":"-"},null,{"$f":"Tab_IIIF_SportPer[[#This Row],[III-F_Funktionen]]","v":"System-Auffassung_2"},334,{"$f":"IF(ROW(C334)-ROW(C$324)+1>COUNT(Tab_IIIF_SportPer[III-F_Zeile]),\"\",INDEX(F:F,SMALL(Tab_IIIF_SportPer[III-F_Zeile],1+ROW(F296)-ROW($F$286))))","v":"Ausbildungsplan"}]
[183,null,{"$f":"B_III_Sport_Konzept!$N15","v":"System-Auffassung_3"},{"$f":"B_III_Sport_Konzept!O15","v":"-"},null,{"$f":"Tab_IIIF_SportPer[[#This Row],[III-F_Funktionen]]","v":"System-Auffassung_3"},335,{"$f":"IF(ROW(C335)-ROW(C$324)+1>COUNT(Tab_IIIF_SportPer[III-F_Zeile]),\"\",INDEX(F:F,SMALL(Tab_IIIF_SportPer[III-F_Zeile],1+ROW(F297)-ROW($F$286))))","v":"Trainingsplan"}]
[184,null,{"$f":"B_III_Sport_Konzept!$N16","v":"System-Auffassung_4"},{"$f":"B_III_Sport_Konzept!O16","v":"-"},null,{"$f":"Tab_IIIF_SportPer[[#This Row],[III-F_Funktionen]]","v":"System-Auffassung_4"},336,{"$f":"IF(ROW(C336)-ROW(C$324)+1>COUNT(Tab_IIIF_SportPer[III-F_Zeile]),\"\",INDEX(F:F,SMALL(Tab_IIIF_SportPer[III-F_Zeile],1+ROW(F298)-ROW($F$286))))","v":"Rahmenbedingung für Trainer verbessern"}]
[185,null,{"$f":"B_III_Sport_Konzept!$N17","v":"System-Auffassung_5"},{"$f":"B_III_Sport_Konzept!O17","v":"-"},null,{"$f":"Tab_IIIF_SportPer[[#This Row],[III-F_Funktionen]]","v":"System-Auffassung_5"},337,{"$f":"IF(ROW(C337)-ROW(C$324)+1>COUNT(Tab_IIIF_SportPer[III-F_Zeile]),\"\",INDEX(F:F,SMALL(Tab_IIIF_SportPer[III-F_Zeile],1+ROW(F299)-ROW($F$286))))","v":"Rahmenbedingung für Spieler verbessern"}]
[186,null,{"$f":"B_III_Sport_Konzept!$N18","v":"System-Auffassung_6"},{"$f":"B_III_Sport_Konzept!O18","v":"-"},null,{"$f":"Tab_IIIF_SportPer[[#This Row],[III-F_Funktionen]]","v":"System-Auffassung_6"},338,{"$f":"IF(ROW(C338)-ROW(C$324)+1>COUNT(Tab_IIIF_SportPer[III-F_Zeile]),\"\",INDEX(F:F,SMALL(Tab_IIIF_SportPer[III-F_Zeile],1+ROW(F300)-ROW($F$286))))","v":"Spiel-Trainings-Ausbildungsplan KM_6"}]
[187,null,{"$f":"B_III_Sport_Konzept!$N19","v":"System-Auffassung_7"},{"$f":"B_III_Sport_Konzept!O19","v":"-"},null,{"$f":"Tab_IIIF_SportPer[[#This Row],[III-F_Funktionen]]","v":"System-Auffassung_7"},339,{"$f":"IF(ROW(C339)-ROW(C$324)+1>COUNT(Tab_IIIF_SportPer[III-F_Zeile]),\"\",INDEX(F:F,SMALL(Tab_IIIF_SportPer[III-F_Zeile],1+ROW(F301)-ROW($F$286))))","v":"Spiel-Trainings-Ausbildungsplan KM_7"}]
[188,null,{"$f":"B_III_Sport_Konzept!$N20","v":"System-Auffassung_8"},{"$f":"B_III_Sport_Konzept!O20","v":"-"},null,{"$f":"Tab_IIIF_SportPer[[#This Row],[III-F_Funktionen]]","v":"System-Auffassung_8"},340,{"$f":"IF(ROW(C340)-ROW(C$324)+1>COUNT(Tab_IIIF_SportPer[III-F_Zeile]),\"\",INDEX(F:F,SMALL(Tab_IIIF_SportPer[III-F_Zeile],1+ROW(F302)-ROW($F$286))))","v":"Spiel-Trainings-Ausbildungsplan KM_8"}]
[189,null,{"$f":"B_III_Sport_Konzept!$N21","v":"System-Auffassung_9"},{"$f":"B_III_Sport_Konzept!O21","v":"-"},null,{"$f":"Tab_IIIF_SportPer[[#This Row],[III-F_Funktionen]]","v":"System-Auffassung_9"},341,{"$f":"IF(ROW(C341)-ROW(C$324)+1>COUNT(Tab_IIIF_SportPer[III-F_Zeile]),\"\",INDEX(F:F,SMALL(Tab_IIIF_SportPer[III-F_Zeile],1+ROW(F303)-ROW($F$286))))","v":"Trainingsplan"}]
[190,null,{"$f":"B_III_Sport_Konzept!$P13","v":"Spielplan"},{"$f":"B_III_Sport_Konzept!Q13","v":"-"},null,{"$f":"Tab_IIIF_SportPer[[#This Row],[III-F_Funktionen]]","v":"Spielplan"},"",{"$f":"IF(ROW(C342)-ROW(C$324)+1>COUNT(Tab_IIIF_SportPer[III-F_Zeile]),\"\",INDEX(F:F,SMALL(Tab_IIIF_SportPer[III-F_Zeile],1+ROW(F304)-ROW($F$286))))","v":"Ausbildungsplan"}]
[191,null,{"$f":"B_III_Sport_Konzept!$P14","v":"Ausbildungsplan"},{"$f":"B_III_Sport_Konzept!Q14","v":"-"},null,{"$f":"Tab_IIIF_SportPer[[#This Row],[III-F_Funktionen]]","v":"Ausbildungsplan"},343,{"$f":"IF(ROW(C343)-ROW(C$324)+1>COUNT(Tab_IIIF_SportPer[III-F_Zeile]),\"\",INDEX(F:F,SMALL(Tab_IIIF_SportPer[III-F_Zeile],1+ROW(F305)-ROW($F$286))))","v":"Rahmenbedingung für NW-Spieler verbessern"}]
[192,null,{"$f":"B_III_Sport_Konzept!$P15","v":"Trainingsplan"},{"$f":"B_III_Sport_Konzept!Q15","v":"-"},null,{"$f":"Tab_IIIF_SportPer[[#This Row],[III-F_Funktionen]]","v":"Trainingsplan"},344,{"$f":"IF(ROW(C344)-ROW(C$324)+1>COUNT(Tab_IIIF_SportPer[III-F_Zeile]),\"\",INDEX(F:F,SMALL(Tab_IIIF_SportPer[III-F_Zeile],1+ROW(F306)-ROW($F$286))))","v":"Spiel-Trainings-Ausbildungsplan NW_6"}]
[193,null,{"$f":"B_III_Sport_Konzept!$P16","v":"Rahmenbedingung für Trainer verbessern"},{"$f":"B_III_Sport_Konzept!Q16","v":"-"},null,{"$f":"Tab_IIIF_SportPer[[#This Row],[III-F_Funktionen]]","v":"Rahmenbedingung für Trainer verbessern"},345,{"$f":"IF(ROW(C345)-ROW(C$324)+1>COUNT(Tab_IIIF_SportPer[III-F_Zeile]),\"\",INDEX(F:F,SMALL(Tab_IIIF_SportPer[III-F_Zeile],1+ROW(F307)-ROW($F$286))))","v":"Spiel-Trainings-Ausbildungsplan NW_7"}]
[194,null,{"$f":"B_III_Sport_Konzept!$P17","v":"Rahmenbedingung für Spieler verbessern"},{"$f":"B_III_Sport_Konzept!Q17","v":"-"},null,{"$f":"Tab_IIIF_SportPer[[#This Row],[III-F_Funktionen]]","v":"Rahmenbedingung für Spieler verbessern"},346,{"$f":"IF(ROW(C346)-ROW(C$324)+1>COUNT(Tab_IIIF_SportPer[III-F_Zeile]),\"\",INDEX(F:F,SMALL(Tab_IIIF_SportPer[III-F_Zeile],1+ROW(F308)-ROW($F$286))))","v":"Spiel-Trainings-Ausbildungsplan NW_8"}]
[195,null,{"$f":"B_III_Sport_Konzept!$P18","v":"Spiel-Trainings-Ausbildungsplan KM_6"},{"$f":"B_III_Sport_Konzept!Q18","v":"-"},null,{"$f":"Tab_IIIF_SportPer[[#This Row],[III-F_Funktionen]]","v":"Spiel-Trainings-Ausbildungsplan KM_6"},347,{"$f":"IF(ROW(C347)-ROW(C$324)+1>COUNT(Tab_IIIF_SportPer[III-F_Zeile]),\"\",INDEX(F:F,SMALL(Tab_IIIF_SportPer[III-F_Zeile],1+ROW(F309)-ROW($F$286))))","v":""}]
[196,null,{"$f":"B_III_Sport_Konzept!$P19","v":"Spiel-Trainings-Ausbildungsplan KM_7"},{"$f":"B_III_Sport_Konzept!Q19","v":"-"},null,{"$f":"Tab_IIIF_SportPer[[#This Row],[III-F_Funktionen]]","v":"Spiel-Trainings-Ausbildungsplan KM_7"},348,{"$f":"IF(ROW(C348)-ROW(C$324)+1>COUNT(Tab_IIIF_SportPer[III-F_Zeile]),\"\",INDEX(F:F,SMALL(Tab_IIIF_SportPer[III-F_Zeile],1+ROW(F310)-ROW($F$286))))","v":""}]
[197,null,{"$f":"B_III_Sport_Konzept!$P20","v":"Spiel-Trainings-Ausbildungsplan KM_8"},{"$f":"B_III_Sport_Konzept!Q20","v":"-"},null,{"$f":"Tab_IIIF_SportPer[[#This Row],[III-F_Funktionen]]","v":"Spiel-Trainings-Ausbildungsplan KM_8"},349,{"$f":"IF(ROW(C349)-ROW(C$324)+1>COUNT(Tab_IIIF_SportPer[III-F_Zeile]),\"\",INDEX(F:F,SMALL(Tab_IIIF_SportPer[III-F_Zeile],1+ROW(F311)-ROW($F$286))))","v":""}]
[198,null,{"$f":"B_III_Sport_Konzept!$P21","v":"Spiel-Trainings-Ausbildungsplan KM_9"},{"$f":"B_III_Sport_Konzept!Q21","v":"-"},null,{"$f":"Tab_IIIF_SportPer[[#This Row],[III-F_Funktionen]]","v":"Spiel-Trainings-Ausbildungsplan KM_9"},"",{"$f":"IF(ROW(C350)-ROW(C$324)+1>COUNT(Tab_IIIF_SportPer[III-F_Zeile]),\"\",INDEX(F:F,SMALL(Tab_IIIF_SportPer[III-F_Zeile],1+ROW(F312)-ROW($F$286))))","v":""}]
[199,null,{"$f":"B_III_Sport_Konzept!$R13","v":"Trainingsplan"},{"$f":"B_III_Sport_Konzept!S13","v":"-"},null,{"$f":"Tab_IIIF_SportPer[[#This Row],[III-F_Funktionen]]","v":"Trainingsplan"},351,{"$f":"IF(ROW(C351)-ROW(C$324)+1>COUNT(Tab_IIIF_SportPer[III-F_Zeile]),\"\",INDEX(F:F,SMALL(Tab_IIIF_SportPer[III-F_Zeile],1+ROW(F313)-ROW($F$286))))","v":""}]
[200,null,{"$f":"B_III_Sport_Konzept!$R14","v":"Ausbildungsplan"},{"$f":"B_III_Sport_Konzept!S14","v":"-"},null,{"$f":"Tab_IIIF_SportPer[[#This Row],[III-F_Funktionen]]","v":"Ausbildungsplan"},352,{"$f":"IF(ROW(C352)-ROW(C$324)+1>COUNT(Tab_IIIF_SportPer[III-F_Zeile]),\"\",INDEX(F:F,SMALL(Tab_IIIF_SportPer[III-F_Zeile],1+ROW(F314)-ROW($F$286))))","v":""}]
[201,null,{"$f":"B_III_Sport_Konzept!$R15","v":"Spielplan"},{"$f":"B_III_Sport_Konzept!S15","v":"-"},null,{"$f":"Tab_IIIF_SportPer[[#This Row],[III-F_Funktionen]]","v":"Spielplan"},"",{"$f":"IF(ROW(C353)-ROW(C$324)+1>COUNT(Tab_IIIF_SportPer[III-F_Zeile]),\"\",INDEX(F:F,SMALL(Tab_IIIF_SportPer[III-F_Zeile],1+ROW(F315)-ROW($F$286))))","v":""}]
[202,null,{"$f":"B_III_Sport_Konzept!$R16","v":"Rahmenbedingung für NW-Trainer verbessern"},{"$f":"B_III_Sport_Konzept!S16","v":"-"},null,{"$f":"Tab_IIIF_SportPer[[#This Row],[III-F_Funktionen]]","v":"Rahmenbedingung für NW-Trainer verbessern"},"",{"$f":"IF(ROW(C354)-ROW(C$324)+1>COUNT(Tab_IIIF_SportPer[III-F_Zeile]),\"\",INDEX(F:F,SMALL(Tab_IIIF_SportPer[III-F_Zeile],1+ROW(F316)-ROW($F$286))))","v":""}]
[203,null,{"$f":"B_III_Sport_Konzept!$R17","v":"Rahmenbedingung für NW-Spieler verbessern"},{"$f":"B_III_Sport_Konzept!S17","v":"-"},null,{"$f":"Tab_IIIF_SportPer[[#This Row],[III-F_Funktionen]]","v":"Rahmenbedingung für NW-Spieler verbessern"},355,{"$f":"IF(ROW(C355)-ROW(C$324)+1>COUNT(Tab_IIIF_SportPer[III-F_Zeile]),\"\",INDEX(F:F,SMALL(Tab_IIIF_SportPer[III-F_Zeile],1+ROW(F317)-ROW($F$286))))","v":""}]
[204,null,{"$f":"B_III_Sport_Konzept!$R18","v":"Spiel-Trainings-Ausbildungsplan NW_6"},{"$f":"B_III_Sport_Konzept!S18","v":"-"},null,{"$f":"Tab_IIIF_SportPer[[#This Row],[III-F_Funktionen]]","v":"Spiel-Trainings-Ausbildungsplan NW_6"},356,{"$f":"IF(ROW(C356)-ROW(C$324)+1>COUNT(Tab_IIIF_SportPer[III-F_Zeile]),\"\",INDEX(F:F,SMALL(Tab_IIIF_SportPer[III-F_Zeile],1+ROW(F318)-ROW($F$286))))","v":""}]
[205,null,{"$f":"B_III_Sport_Konzept!$R19","v":"Spiel-Trainings-Ausbildungsplan NW_7"},{"$f":"B_III_Sport_Konzept!S19","v":"-"},null,{"$f":"Tab_IIIF_SportPer[[#This Row],[III-F_Funktionen]]","v":"Spiel-Trainings-Ausbildungsplan NW_7"},357,{"$f":"IF(ROW(C357)-ROW(C$324)+1>COUNT(Tab_IIIF_SportPer[III-F_Zeile]),\"\",INDEX(F:F,SMALL(Tab_IIIF_SportPer[III-F_Zeile],1+ROW(F319)-ROW($F$286))))","v":""}]
[206,null,{"$f":"B_III_Sport_Konzept!$R20","v":"Spiel-Trainings-Ausbildungsplan NW_8"},{"$f":"B_III_Sport_Konzept!S20","v":"-"},null,{"$f":"Tab_IIIF_SportPer[[#This Row],[III-F_Funktionen]]","v":"Spiel-Trainings-Ausbildungsplan NW_8"},358,{"$f":"IF(ROW(C358)-ROW(C$324)+1>COUNT(Tab_IIIF_SportPer[III-F_Zeile]),\"\",INDEX(F:F,SMALL(Tab_IIIF_SportPer[III-F_Zeile],1+ROW(F320)-ROW($F$286))))","v":""}]
[207,null,{"$f":"B_III_Sport_Konzept!$R21","v":"Spiel-Trainings-Ausbildungsplan NW_9"},{"$f":"B_III_Sport_Konzept!S21","v":"-"},null,{"$f":"Tab_IIIF_SportPer[[#This Row],[III-F_Funktionen]]","v":"Spiel-Trainings-Ausbildungsplan NW_9"},"",{"$f":"IF(ROW(C359)-ROW(C$324)+1>COUNT(Tab_IIIF_SportPer[III-F_Zeile]),\"\",INDEX(F:F,SMALL(Tab_IIIF_SportPer[III-F_Zeile],1+ROW(F321)-ROW($F$286))))","v":""}]
[]
["L_Nr.","III. Sportkonzept","III-G_Funktionen","III-G_Werte","III-G_100%","III-G_Funktion","III-G_Zeile","III-G_noch möglich"]
[208,{"$f":"B_III_Sport_Konzept!$B$7","v":"G. Sportumfeldperspektive"},{"$f":"B_III_Sport_Konzept!$L$24","v":"Sportumfeld-Test_1"},{"$f":"B_III_Sport_Konzept!M24","v":"-"},null,{"$f":"Tab_IIIG_SportumfeldPer[[#This Row],[III-G_Funktionen]]","v":"Sportumfeld-Test_1"},{"$f":"IF(COUNTIF($C$79:$C$84,F362)>=1,\"\",ROW())","v":362},{"$f":"IF(ROW(C362)-ROW(C$362)+1>COUNT(Tab_IIIG_SportumfeldPer[III-G_Zeile]),\"\",INDEX(F:F,SMALL(Tab_IIIG_SportumfeldPer[III-G_Zeile],1+ROW(F362)-ROW($F$362))))","v":"Sportumfeld-Test_1"}]
[209,null,{"$f":"B_III_Sport_Konzept!$L$25","v":"Sportumfeld-Test_2"},{"$f":"B_III_Sport_Konzept!M25","v":"-"},null,{"$f":"Tab_IIIG_SportumfeldPer[[#This Row],[III-G_Funktionen]]","v":"Sportumfeld-Test_2"},{"$f":"IF(COUNTIF($C$79:$C$84,F363)>=1,\"\",ROW())","v":363},{"$f":"IF(ROW(C363)-ROW(C$362)+1>COUNT(Tab_IIIG_SportumfeldPer[III-G_Zeile]),\"\",INDEX(F:F,SMALL(Tab_IIIG_SportumfeldPer[III-G_Zeile],1+ROW(F363)-ROW($F$362))))","v":"Sportumfeld-Test_2"}]
[210,null,{"$f":"B_III_Sport_Konzept!$L$26","v":"Sportumfeld-Test_3"},{"$f":"B_III_Sport_Konzept!M26","v":"-"},null,{"$f":"Tab_IIIG_SportumfeldPer[[#This Row],[III-G_Funktionen]]","v":"Sportumfeld-Test_3"},364,{"$f":"IF(ROW(C364)-ROW(C$362)+1>COUNT(Tab_IIIG_SportumfeldPer[III-G_Zeile]),\"\",INDEX(F:F,SMALL(Tab_IIIG_SportumfeldPer[III-G_Zeile],1+ROW(F364)-ROW($F$362))))","v":"Sportumfeld-Test_3"}]
[211,null,{"$f":"B_III_Sport_Konzept!$L$27","v":"Sportumfeld-Test_4"},{"$f":"B_III_Sport_Konzept!M27","v":"-"},null,{"$f":"Tab_IIIG_SportumfeldPer[[#This Row],[III-G_Funktionen]]","v":"Sportumfeld-Test_4"},365,{"$f":"IF(ROW(C365)-ROW(C$362)+1>COUNT(Tab_IIIG_SportumfeldPer[III-G_Zeile]),\"\",INDEX(F:F,SMALL(Tab_IIIG_SportumfeldPer[III-G_Zeile],1+ROW(F365)-ROW($F$362))))","v":"Sportumfeld-Test_4"}]
[212,null,{"$f":"B_III_Sport_Konzept!$L$28","v":"Sportumfeld-Test_5"},{"$f":"B_III_Sport_Konzept!M28","v":"-"},null,{"$f":"Tab_IIIG_SportumfeldPer[[#This Row],[III-G_Funktionen]]","v":"Sportumfeld-Test_5"},366,{"$f":"IF(ROW(C366)-ROW(C$362)+1>COUNT(Tab_IIIG_SportumfeldPer[III-G_Zeile]),\"\",INDEX(F:F,SMALL(Tab_IIIG_SportumfeldPer[III-G_Zeile],1+ROW(F366)-ROW($F$362))))","v":"Sportumfeld-Test_5"}]
[213,null,{"$f":"B_III_Sport_Konzept!$L$29","v":"Sportumfeld-Test_6"},{"$f":"B_III_Sport_Konzept!M29","v":"-"},null,{"$f":"Tab_IIIG_SportumfeldPer[[#This Row],[III-G_Funktionen]]","v":"Sportumfeld-Test_6"},"",{"$f":"IF(ROW(C367)-ROW(C$362)+1>COUNT(Tab_IIIG_SportumfeldPer[III-G_Zeile]),\"\",INDEX(F:F,SMALL(Tab_IIIG_SportumfeldPer[III-G_Zeile],1+ROW(F367)-ROW($F$362))))","v":"Sportumfeld-Test_8"}]
[214,null,{"$f":"B_III_Sport_Konzept!$L$30","v":"Sportumfeld-Test_7"},{"$f":"B_III_Sport_Konzept!M30","v":"-"},null,{"$f":"Tab_IIIG_SportumfeldPer[[#This Row],[III-G_Funktionen]]","v":"Sportumfeld-Test_7"},"",{"$f":"IF(ROW(C368)-ROW(C$362)+1>COUNT(Tab_IIIG_SportumfeldPer[III-G_Zeile]),\"\",INDEX(F:F,SMALL(Tab_IIIG_SportumfeldPer[III-G_Zeile],1+ROW(F368)-ROW($F$362))))","v":"Sportumfeld_2-Test_2"}]
[215,null,{"$f":"B_III_Sport_Konzept!$L$31","v":"Sportumfeld-Test_8"},{"$f":"B_III_Sport_Konzept!M31","v":"-"},null,{"$f":"Tab_IIIG_SportumfeldPer[[#This Row],[III-G_Funktionen]]","v":"Sportumfeld-Test_8"},369,{"$f":"IF(ROW(C369)-ROW(C$362)+1>COUNT(Tab_IIIG_SportumfeldPer[III-G_Zeile]),\"\",INDEX(F:F,SMALL(Tab_IIIG_SportumfeldPer[III-G_Zeile],1+ROW(F369)-ROW($F$362))))","v":"Sportumfeld_2-Test_4"}]
[216,null,{"$f":"B_III_Sport_Konzept!$L$32","v":"Sportumfeld-Test_9"},{"$f":"B_III_Sport_Konzept!M32","v":"-"},null,{"$f":"Tab_IIIG_SportumfeldPer[[#This Row],[III-G_Funktionen]]","v":"Sportumfeld-Test_9"},"",{"$f":"IF(ROW(C370)-ROW(C$362)+1>COUNT(Tab_IIIG_SportumfeldPer[III-G_Zeile]),\"\",INDEX(F:F,SMALL(Tab_IIIG_SportumfeldPer[III-G_Zeile],1+ROW(F370)-ROW($F$362))))","v":"Sportumfeld_2-Test_5"}]
[217,null,{"$f":"B_III_Sport_Konzept!$N$24","v":"Sportumfeld_2-Test_1"},{"$f":"B_III_Sport_Konzept!O24","v":"-"},null,{"$f":"Tab_IIIG_SportumfeldPer[[#This Row],[III-G_Funktionen]]","v":"Sportumfeld_2-Test_1"},"",{"$f":"IF(ROW(C371)-ROW(C$362)+1>COUNT(Tab_IIIG_SportumfeldPer[III-G_Zeile]),\"\",INDEX(F:F,SMALL(Tab_IIIG_SportumfeldPer[III-G_Zeile],1+ROW(F371)-ROW($F$362))))","v":"Sportumfeld_2-Test_6"}]
[218,null,{"$f":"B_III_Sport_Konzept!$N$25","v":"Sportumfeld_2-Test_2"},{"$f":"B_III_Sport_Konzept!O25","v":"-"},null,{"$f":"Tab_IIIG_SportumfeldPer[[#This Row],[III-G_Funktionen]]","v":"Sportumfeld_2-Test_2"},372,{"$f":"IF(ROW(C372)-ROW(C$362)+1>COUNT(Tab_IIIG_SportumfeldPer[III-G_Zeile]),\"\",INDEX(F:F,SMALL(Tab_IIIG_SportumfeldPer[III-G_Zeile],1+ROW(F372)-ROW($F$362))))","v":"Sportumfeld_2-Test_7"}]
[219,null,{"$f":"B_III_Sport_Konzept!$N$26","v":"Sportumfeld_2-Test_3"},{"$f":"B_III_Sport_Konzept!O26","v":"-"},null,{"$f":"Tab_IIIG_SportumfeldPer[[#This Row],[III-G_Funktionen]]","v":"Sportumfeld_2-Test_3"},"",{"$f":"IF(ROW(C373)-ROW(C$362)+1>COUNT(Tab_IIIG_SportumfeldPer[III-G_Zeile]),\"\",INDEX(F:F,SMALL(Tab_IIIG_SportumfeldPer[III-G_Zeile],1+ROW(F373)-ROW($F$362))))","v":"Sportumfeld_2-Test_8"}]
[220,null,{"$f":"B_III_Sport_Konzept!$N$27","v":"Sportumfeld_2-Test_4"},{"$f":"B_III_Sport_Konzept!O27","v":"-"},null,{"$f":"Tab_IIIG_SportumfeldPer[[#This Row],[III-G_Funktionen]]","v":"Sportumfeld_2-Test_4"},374,{"$f":"IF(ROW(C374)-ROW(C$362)+1>COUNT(Tab_IIIG_SportumfeldPer[III-G_Zeile]),\"\",INDEX(F:F,SMALL(Tab_IIIG_SportumfeldPer[III-G_Zeile],1+ROW(F374)-ROW($F$362))))","v":""}]
[221,null,{"$f":"B_III_Sport_Konzept!$N$28","v":"Sportumfeld_2-Test_5"},{"$f":"B_III_Sport_Konzept!O28","v":"-"},null,{"$f":"Tab_IIIG_SportumfeldPer[[#This Row],[III-G_Funktionen]]","v":"Sportumfeld_2-Test_5"},375,{"$f":"IF(ROW(C375)-ROW(C$362)+1>COUNT(Tab_IIIG_SportumfeldPer[III-G_Zeile]),\"\",INDEX(F:F,SMALL(Tab_IIIG_SportumfeldPer[III-G_Zeile],1+ROW(F375)-ROW($F$362))))","v":""}]
[222,null,{"$f":"B_III_Sport_Konzept!$N$29","v":"Sportumfeld_2-Test_6"},{"$f":"B_III_Sport_Konzept!O29","v":"-"},null,{"$f":"Tab_IIIG_SportumfeldPer[[#This Row],[III-G_Funktionen]]","v":"Sportumfeld_2-Test_6"},376,{"$f":"IF(ROW(C376)-ROW(C$362)+1>COUNT(Tab_IIIG_SportumfeldPer[III-G_Zeile]),\"\",INDEX(F:F,SMALL(Tab_IIIG_SportumfeldPer[III-G_Zeile],1+ROW(F376)-ROW($F$362))))","v":""}]
[223,null,{"$f":"B_III_Sport_Konzept!$N$30","v":"Sportumfeld_2-Test_7"},{"$f":"B_III_Sport_Konzept!O30","v":"-"},null,{"$f":"Tab_IIIG_SportumfeldPer[[#This Row],[III-G_Funktionen]]","v":"Sportumfeld_2-Test_7"},377,{"$f":"IF(ROW(C377)-ROW(C$362)+1>COUNT(Tab_IIIG_SportumfeldPer[III-G_Zeile]),\"\",INDEX(F:F,SMALL(Tab_IIIG_SportumfeldPer[III-G_Zeile],1+ROW(F377)-ROW($F$362))))","v":""}]
[224,null,{"$f":"B_III_Sport_Konzept!$N$31","v":"Sportumfeld_2-Test_8"},{"$f":"B_III_Sport_Konzept!O31","v":"-"},null,{"$f":"Tab_IIIG_SportumfeldPer[[#This Row],[III-G_Funktionen]]","v":"Sportumfeld_2-Test_8"},378,{"$f":"IF(ROW(C378)-ROW(C$362)+1>COUNT(Tab_IIIG_SportumfeldPer[III-G_Zeile]),\"\",INDEX(F:F,SMALL(Tab_IIIG_SportumfeldPer[III-G_Zeile],1+ROW(F378)-ROW($F$362))))","v":""}]
[225,null,{"$f":"B_III_Sport_Konzept!$N$32","v":"Sportumfeld_2-Test_9"},{"$f":"B_III_Sport_Konzept!O32","v":"-"},null,{"$f":"Tab_IIIG_SportumfeldPer[[#This Row],[III-G_Funktionen]]","v":"Sportumfeld_2-Test_9"},"",{"$f":"IF(ROW(C379)-ROW(C$362)+1>COUNT(Tab_IIIG_SportumfeldPer[III-G_Zeile]),\"\",INDEX(F:F,SMALL(Tab_IIIG_SportumfeldPer[III-G_Zeile],1+ROW(F379)-ROW($F$362))))","v":""}]
[]
["L_Nr.","IV. Vermarktungskonzept","IV-H_Funktionen","IV-H_Werte","IV-H_100%","IV-H_Funktion","IV-H_Zeile","IV-H_noch möglich"]
[226,{"$f":"B_IV_Vermarktungs_Konzept!$B$5","v":"H. Öffentlichkeitsperspektive"},{"$f":"B_IV_Vermarktungs_Konzept!$L2","v":"Grundstrategie"},{"$f":"B_IV_Vermarktungs_Konzept!M2","v":"-"},null,{"$f":"Tab_IVH_ÖffentlPer[[#This Row],[IV-H_Funktionen]]","v":"Grundstrategie"},{"$f":"IF(COUNTIF($C$86:$C$100,F382)>=1,\"\",ROW())","v":""},{"$f":"IF(ROW(C382)-ROW(C$382)+1>COUNT(Tab_IVH_ÖffentlPer[IV-H_Zeile]),\"\",INDEX(F:F,SMALL(Tab_IVH_ÖffentlPer[IV-H_Zeile],1+ROW(F382)-ROW($F$382))))","v":"Selbstbild des Vereins"}]
[227,null,{"$f":"B_IV_Vermarktungs_Konzept!$L3","v":"Positionierung"},{"$f":"B_IV_Vermarktungs_Konzept!M3","v":"-"},null,{"$f":"Tab_IVH_ÖffentlPer[[#This Row],[IV-H_Funktionen]]","v":"Positionierung"},{"$f":"IF(COUNTIF($C$86:$C$100,F383)>=1,\"\",ROW())","v":""},{"$f":"IF(ROW(C383)-ROW(C$382)+1>COUNT(Tab_IVH_ÖffentlPer[IV-H_Zeile]),\"\",INDEX(F:F,SMALL(Tab_IVH_ÖffentlPer[IV-H_Zeile],1+ROW(F383)-ROW($F$382))))","v":"Fremdbild des Vereins"}]
[228,null,{"$f":"B_IV_Vermarktungs_Konzept!$L4","v":"Darstellung nach Außen"},{"$f":"B_IV_Vermarktungs_Konzept!M4","v":"-"},null,{"$f":"Tab_IVH_ÖffentlPer[[#This Row],[IV-H_Funktionen]]","v":"Darstellung nach Außen"},"",{"$f":"IF(ROW(C384)-ROW(C$382)+1>COUNT(Tab_IVH_ÖffentlPer[IV-H_Zeile]),\"\",INDEX(F:F,SMALL(Tab_IVH_ÖffentlPer[IV-H_Zeile],1+ROW(F384)-ROW($F$382))))","v":"Vereinsgelände"}]
[229,null,{"$f":"B_IV_Vermarktungs_Konzept!$L5","v":"Selbstbild des Vereins"},{"$f":"B_IV_Vermarktungs_Konzept!M5","v":"-"},null,{"$f":"Tab_IVH_ÖffentlPer[[#This Row],[IV-H_Funktionen]]","v":"Selbstbild des Vereins"},385,{"$f":"IF(ROW(C385)-ROW(C$382)+1>COUNT(Tab_IVH_ÖffentlPer[IV-H_Zeile]),\"\",INDEX(F:F,SMALL(Tab_IVH_ÖffentlPer[IV-H_Zeile],1+ROW(F385)-ROW($F$382))))","v":"Denkhaltungen"}]
[230,null,{"$f":"B_IV_Vermarktungs_Konzept!$L6","v":"Fremdbild des Vereins"},{"$f":"B_IV_Vermarktungs_Konzept!M6","v":"-"},null,{"$f":"Tab_IVH_ÖffentlPer[[#This Row],[IV-H_Funktionen]]","v":"Fremdbild des Vereins"},386,{"$f":"IF(ROW(C386)-ROW(C$382)+1>COUNT(Tab_IVH_ÖffentlPer[IV-H_Zeile]),\"\",INDEX(F:F,SMALL(Tab_IVH_ÖffentlPer[IV-H_Zeile],1+ROW(F386)-ROW($F$382))))","v":"Vereinswebsite"}]
[231,null,{"$f":"B_IV_Vermarktungs_Konzept!$L7","v":"Werte"},{"$f":"B_IV_Vermarktungs_Konzept!M7","v":"-"},null,{"$f":"Tab_IVH_ÖffentlPer[[#This Row],[IV-H_Funktionen]]","v":"Werte"},"",{"$f":"IF(ROW(C387)-ROW(C$382)+1>COUNT(Tab_IVH_ÖffentlPer[IV-H_Zeile]),\"\",INDEX(F:F,SMALL(Tab_IVH_ÖffentlPer[IV-H_Zeile],1+ROW(F387)-ROW($F$382))))","v":"Verbandswebsite"}]
[232,null,{"$f":"B_IV_Vermarktungs_Konzept!$L8","v":"Vereinsgelände"},{"$f":"B_IV_Vermarktungs_Konzept!M8","v":"-"},null,{"$f":"Tab_IVH_ÖffentlPer[[#This Row],[IV-H_Funktionen]]","v":"Vereinsgelände"},388,{"$f":"IF(ROW(C388)-ROW(C$382)+1>COUNT(Tab_IVH_ÖffentlPer[IV-H_Zeile]),\"\",INDEX(F:F,SMALL(Tab_IVH_ÖffentlPer[IV-H_Zeile],1+ROW(F388)-ROW($F$382))))","v":"Spieltaginformation"}]
[233,null,{"$f":"B_IV_Vermarktungs_Konzept!$L9","v":"Denkhaltungen"},{"$f":"B_IV_Vermarktungs_Konzept!M9","v":"-"},null,{"$f":"Tab_IVH_ÖffentlPer[[#This Row],[IV-H_Funktionen]]","v":"Denkhaltungen"},389,{"$f":"IF(ROW(C389)-ROW(C$382)+1>COUNT(Tab_IVH_ÖffentlPer[IV-H_Zeile]),\"\",INDEX(F:F,SMALL(Tab_IVH_ÖffentlPer[IV-H_Zeile],1+ROW(F389)-ROW($F$382))))","v":"E-Mail Informationen"}]
[234,null,{"$f":"B_IV_Vermarktungs_Konzept!$L10","v":"Paradigmen"},{"$f":"B_IV_Vermarktungs_Konzept!M10","v":"-"},null,{"$f":"Tab_IVH_ÖffentlPer[[#This Row],[IV-H_Funktionen]]","v":"Paradigmen"},"",{"$f":"IF(ROW(C390)-ROW(C$382)+1>COUNT(Tab_IVH_ÖffentlPer[IV-H_Zeile]),\"\",INDEX(F:F,SMALL(Tab_IVH_ÖffentlPer[IV-H_Zeile],1+ROW(F390)-ROW($F$382))))","v":"Printmedien"}]
[235,null,{"$f":"B_IV_Vermarktungs_Konzept!$N2","v":"Vereinswebsite"},{"$f":"B_IV_Vermarktungs_Konzept!O2","v":"-"},null,{"$f":"Tab_IVH_ÖffentlPer[[#This Row],[IV-H_Funktionen]]","v":"Vereinswebsite"},391,{"$f":"IF(ROW(C391)-ROW(C$382)+1>COUNT(Tab_IVH_ÖffentlPer[IV-H_Zeile]),\"\",INDEX(F:F,SMALL(Tab_IVH_ÖffentlPer[IV-H_Zeile],1+ROW(F391)-ROW($F$382))))","v":"Regional TV"}]
[236,null,{"$f":"B_IV_Vermarktungs_Konzept!$N3","v":"Verbandswebsite"},{"$f":"B_IV_Vermarktungs_Konzept!O3","v":"-"},null,{"$f":"Tab_IVH_ÖffentlPer[[#This Row],[IV-H_Funktionen]]","v":"Verbandswebsite"},392,{"$f":"IF(ROW(C392)-ROW(C$382)+1>COUNT(Tab_IVH_ÖffentlPer[IV-H_Zeile]),\"\",INDEX(F:F,SMALL(Tab_IVH_ÖffentlPer[IV-H_Zeile],1+ROW(F392)-ROW($F$382))))","v":"Platzsprecher"}]
[237,null,{"$f":"B_IV_Vermarktungs_Konzept!$N4","v":"Soziale Medien"},{"$f":"B_IV_Vermarktungs_Konzept!O4","v":"-"},null,{"$f":"Tab_IVH_ÖffentlPer[[#This Row],[IV-H_Funktionen]]","v":"Soziale Medien"},"",{"$f":"IF(ROW(C393)-ROW(C$382)+1>COUNT(Tab_IVH_ÖffentlPer[IV-H_Zeile]),\"\",INDEX(F:F,SMALL(Tab_IVH_ÖffentlPer[IV-H_Zeile],1+ROW(F393)-ROW($F$382))))","v":"Kommunikation_1"}]
[238,null,{"$f":"B_IV_Vermarktungs_Konzept!$N5","v":"Spieltaginformation"},{"$f":"B_IV_Vermarktungs_Konzept!O5","v":"-"},null,{"$f":"Tab_IVH_ÖffentlPer[[#This Row],[IV-H_Funktionen]]","v":"Spieltaginformation"},394,{"$f":"IF(ROW(C394)-ROW(C$382)+1>COUNT(Tab_IVH_ÖffentlPer[IV-H_Zeile]),\"\",INDEX(F:F,SMALL(Tab_IVH_ÖffentlPer[IV-H_Zeile],1+ROW(F394)-ROW($F$382))))","v":"Kommunikation_2"}]
[239,null,{"$f":"B_IV_Vermarktungs_Konzept!$N6","v":"E-Mail Informationen"},{"$f":"B_IV_Vermarktungs_Konzept!O6","v":"-"},null,{"$f":"Tab_IVH_ÖffentlPer[[#This Row],[IV-H_Funktionen]]","v":"E-Mail Informationen"},395,{"$f":"IF(ROW(C395)-ROW(C$382)+1>COUNT(Tab_IVH_ÖffentlPer[IV-H_Zeile]),\"\",INDEX(F:F,SMALL(Tab_IVH_ÖffentlPer[IV-H_Zeile],1+ROW(F395)-ROW($F$382))))","v":"Kommunikation_3"}]
[240,null,{"$f":"B_IV_Vermarktungs_Konzept!$N7","v":"Printmedien"},{"$f":"B_IV_Vermarktungs_Konzept!O7","v":"-"},null,{"$f":"Tab_IVH_ÖffentlPer[[#This Row],[IV-H_Funktionen]]","v":"Printmedien"},396,{"$f":"IF(ROW(C396)-ROW(C$382)+1>COUNT(Tab_IVH_ÖffentlPer[IV-H_Zeile]),\"\",INDEX(F:F,SMALL(Tab_IVH_ÖffentlPer[IV-H_Zeile],1+ROW(F396)-ROW($F$382))))","v":"Kommunikation_4"}]
[241,null,{"$f":"B_IV_Vermarktungs_Konzept!$N8","v":"Regional TV"},{"$f":"B_IV_Vermarktungs_Konzept!O8","v":"-"},null,{"$f":"Tab_IVH_ÖffentlPer[[#This Row],[IV-H_Funktionen]]","v":"Regional TV"},397,{"$f":"IF(ROW(C397)-ROW(C$382)+1>COUNT(Tab_IVH_ÖffentlPer[IV-H_Zeile]),\"\",INDEX(F:F,SMALL(Tab_IVH_ÖffentlPer[IV-H_Zeile],1+ROW(F397)-ROW($F$382))))","v":"Kommunikation_6"}]
[242,null,{"$f":"B_IV_Vermarktungs_Konzept!$N9","v":"Platzsprecher"},{"$f":"B_IV_Vermarktungs_Konzept!O9","v":"-"},null,{"$f":"Tab_IVH_ÖffentlPer[[#This Row],[IV-H_Funktionen]]","v":"Platzsprecher"},398,{"$f":"IF(ROW(C398)-ROW(C$382)+1>COUNT(Tab_IVH_ÖffentlPer[IV-H_Zeile]),\"\",INDEX(F:F,SMALL(Tab_IVH_ÖffentlPer[IV-H_Zeile],1+ROW(F398)-ROW($F$382))))","v":"Kommunikation_7"}]
[243,null,{"$f":"B_IV_Vermarktungs_Konzept!$N10","v":"Elternabende für NW Mannschaften"},{"$f":"B_IV_Vermarktungs_Konzept!O10","v":"-"},null,{"$f":"Tab_IVH_ÖffentlPer[[#This Row],[IV-H_Funktionen]]","v":"Elternabende für NW Mannschaften"},"",{"$f":"IF(ROW(C399)-ROW(C$382)+1>COUNT(Tab_IVH_ÖffentlPer[IV-H_Zeile]),\"\",INDEX(F:F,SMALL(Tab_IVH_ÖffentlPer[IV-H_Zeile],1+ROW(F399)-ROW($F$382))))","v":"Kommunikation_8"}]
[244,null,{"$f":"B_IV_Vermarktungs_Konzept!$P2","v":"Kommunikation_1"},{"$f":"B_IV_Vermarktungs_Konzept!Q2","v":"-"},null,{"$f":"Tab_IVH_ÖffentlPer[[#This Row],[IV-H_Funktionen]]","v":"Kommunikation_1"},400,{"$f":"IF(ROW(C400)-ROW(C$382)+1>COUNT(Tab_IVH_ÖffentlPer[IV-H_Zeile]),\"\",INDEX(F:F,SMALL(Tab_IVH_ÖffentlPer[IV-H_Zeile],1+ROW(F400)-ROW($F$382))))","v":"Kommunikation_9"}]
[245,null,{"$f":"B_IV_Vermarktungs_Konzept!$P3","v":"Kommunikation_2"},{"$f":"B_IV_Vermarktungs_Konzept!Q3","v":"-"},null,{"$f":"Tab_IVH_ÖffentlPer[[#This Row],[IV-H_Funktionen]]","v":"Kommunikation_2"},401,{"$f":"IF(ROW(C401)-ROW(C$382)+1>COUNT(Tab_IVH_ÖffentlPer[IV-H_Zeile]),\"\",INDEX(F:F,SMALL(Tab_IVH_ÖffentlPer[IV-H_Zeile],1+ROW(F401)-ROW($F$382))))","v":"Musterevent_1"}]
[246,null,{"$f":"B_IV_Vermarktungs_Konzept!$P4","v":"Kommunikation_3"},{"$f":"B_IV_Vermarktungs_Konzept!Q4","v":"-"},null,{"$f":"Tab_IVH_ÖffentlPer[[#This Row],[IV-H_Funktionen]]","v":"Kommunikation_3"},402,{"$f":"IF(ROW(C402)-ROW(C$382)+1>COUNT(Tab_IVH_ÖffentlPer[IV-H_Zeile]),\"\",INDEX(F:F,SMALL(Tab_IVH_ÖffentlPer[IV-H_Zeile],1+ROW(F402)-ROW($F$382))))","v":"Musterevent_2"}]
[247,null,{"$f":"B_IV_Vermarktungs_Konzept!$P5","v":"Kommunikation_4"},{"$f":"B_IV_Vermarktungs_Konzept!Q5","v":"-"},null,{"$f":"Tab_IVH_ÖffentlPer[[#This Row],[IV-H_Funktionen]]","v":"Kommunikation_4"},403,{"$f":"IF(ROW(C403)-ROW(C$382)+1>COUNT(Tab_IVH_ÖffentlPer[IV-H_Zeile]),\"\",INDEX(F:F,SMALL(Tab_IVH_ÖffentlPer[IV-H_Zeile],1+ROW(F403)-ROW($F$382))))","v":"Musterevent_4"}]
[248,null,{"$f":"B_IV_Vermarktungs_Konzept!$P6","v":"Kommunikation_5"},{"$f":"B_IV_Vermarktungs_Konzept!Q6","v":"-"},null,{"$f":"Tab_IVH_ÖffentlPer[[#This Row],[IV-H_Funktionen]]","v":"Kommunikation_5"},"",{"$f":"IF(ROW(C404)-ROW(C$382)+1>COUNT(Tab_IVH_ÖffentlPer[IV-H_Zeile]),\"\",INDEX(F:F,SMALL(Tab_IVH_ÖffentlPer[IV-H_Zeile],1+ROW(F404)-ROW($F$382))))","v":"Musterevent_5"}]
[249,null,{"$f":"B_IV_Vermarktungs_Konzept!$P7","v":"Kommunikation_6"},{"$f":"B_IV_Vermarktungs_Konzept!Q7","v":"-"},null,{"$f":"Tab_IVH_ÖffentlPer[[#This Row],[IV-H_Funktionen]]","v":"Kommunikation_6"},405,{"$f":"IF(ROW(C405)-ROW(C$382)+1>COUNT(Tab_IVH_ÖffentlPer[IV-H_Zeile]),\"\",INDEX(F:F,SMALL(Tab_IVH_ÖffentlPer[IV-H_Zeile],1+ROW(F405)-ROW($F$382))))","v":"Musterevent_6"}]
[250,null,{"$f":"B_IV_Vermarktungs_Konzept!$P8","v":"Kommunikation_7"},{"$f":"B_IV_Vermarktungs_Konzept!Q8","v":"-"},null,{"$f":"Tab_IVH_ÖffentlPer[[#This Row],[IV-H_Funktionen]]","v":"Kommunikation_7"},406,{"$f":"IF(ROW(C406)-ROW(C$382)+1>COUNT(Tab_IVH_ÖffentlPer[IV-H_Zeile]),\"\",INDEX(F:F,SMALL(Tab_IVH_ÖffentlPer[IV-H_Zeile],1+ROW(F406)-ROW($F$382))))","v":"Musterevent_7"}]
[251,null,{"$f":"B_IV_Vermarktungs_Konzept!$P9","v":"Kommunikation_8"},{"$f":"B_IV_Vermarktungs_Konzept!Q9","v":"-"},null,{"$f":"Tab_IVH_ÖffentlPer[[#This Row],[IV-H_Funktionen]]","v":"Kommunikation_8"},407,{"$f":"IF(ROW(C407)-ROW(C$382)+1>COUNT(Tab_IVH_ÖffentlPer[IV-H_Zeile]),\"\",INDEX(F:F,SMALL(Tab_IVH_ÖffentlPer[IV-H_Zeile],1+ROW(F407)-ROW($F$382))))","v":"Musterevent_8"}]
[252,null,{"$f":"B_IV_Vermarktungs_Konzept!$P10","v":"Kommunikation_9"},{"$f":"B_IV_Vermarktungs_Konzept!Q10","v":"-"},null,{"$f":"Tab_IVH_ÖffentlPer[[#This Row],[IV-H_Funktionen]]","v":"Kommunikation_9"},408,{"$f":"IF(ROW(C408)-ROW(C$382)+1>COUNT(Tab_IVH_ÖffentlPer[IV-H_Zeile]),\"\",INDEX(F:F,SMALL(Tab_IVH_ÖffentlPer[IV-H_Zeile],1+ROW(F408)-ROW($F$382))))","v":"Musterevent_9"}]
[253,null,{"$f":"B_IV_Vermarktungs_Konzept!$R2","v":"Musterevent_1"},{"$f":"B_IV_Vermarktungs_Konzept!S2","v":"-"},null,{"$f":"Tab_IVH_ÖffentlPer[[#This Row],[IV-H_Funktionen]]","v":"Musterevent_1"},409,{"$f":"IF(ROW(C409)-ROW(C$382)+1>COUNT(Tab_IVH_ÖffentlPer[IV-H_Zeile]),\"\",INDEX(F:F,SMALL(Tab_IVH_ÖffentlPer[IV-H_Zeile],1+ROW(F409)-ROW($F$382))))","v":"BMar1 - Mitgliederzahlen steigen"}]
[254,null,{"$f":"B_IV_Vermarktungs_Konzept!$R3","v":"Musterevent_2"},{"$f":"B_IV_Vermarktungs_Konzept!S3","v":"-"},null,{"$f":"Tab_IVH_ÖffentlPer[[#This Row],[IV-H_Funktionen]]","v":"Musterevent_2"},410,{"$f":"IF(ROW(C410)-ROW(C$382)+1>COUNT(Tab_IVH_ÖffentlPer[IV-H_Zeile]),\"\",INDEX(F:F,SMALL(Tab_IVH_ÖffentlPer[IV-H_Zeile],1+ROW(F410)-ROW($F$382))))","v":"Soziale Anerkennung steigt"}]
[255,null,{"$f":"B_IV_Vermarktungs_Konzept!$R4","v":"Musterevent_3"},{"$f":"B_IV_Vermarktungs_Konzept!S4","v":"-"},null,{"$f":"Tab_IVH_ÖffentlPer[[#This Row],[IV-H_Funktionen]]","v":"Musterevent_3"},"",{"$f":"IF(ROW(C411)-ROW(C$382)+1>COUNT(Tab_IVH_ÖffentlPer[IV-H_Zeile]),\"\",INDEX(F:F,SMALL(Tab_IVH_ÖffentlPer[IV-H_Zeile],1+ROW(F411)-ROW($F$382))))","v":"Benchmark_8"}]
[256,null,{"$f":"B_IV_Vermarktungs_Konzept!$R5","v":"Musterevent_4"},{"$f":"B_IV_Vermarktungs_Konzept!S5","v":"-"},null,{"$f":"Tab_IVH_ÖffentlPer[[#This Row],[IV-H_Funktionen]]","v":"Musterevent_4"},412,{"$f":"IF(ROW(C412)-ROW(C$382)+1>COUNT(Tab_IVH_ÖffentlPer[IV-H_Zeile]),\"\",INDEX(F:F,SMALL(Tab_IVH_ÖffentlPer[IV-H_Zeile],1+ROW(F412)-ROW($F$382))))","v":"Benchmark_9"}]
[257,null,{"$f":"B_IV_Vermarktungs_Konzept!$R6","v":"Musterevent_5"},{"$f":"B_IV_Vermarktungs_Konzept!S6","v":"-"},null,{"$f":"Tab_IVH_ÖffentlPer[[#This Row],[IV-H_Funktionen]]","v":"Musterevent_5"},413,{"$f":"IF(ROW(C413)-ROW(C$382)+1>COUNT(Tab_IVH_ÖffentlPer[IV-H_Zeile]),\"\",INDEX(F:F,SMALL(Tab_IVH_ÖffentlPer[IV-H_Zeile],1+ROW(F413)-ROW($F$382))))","v":""}]
[258,null,{"$f":"B_IV_Vermarktungs_Konzept!$R7","v":"Musterevent_6"},{"$f":"B_IV_Vermarktungs_Konzept!S7","v":"-"},null,{"$f":"Tab_IVH_ÖffentlPer[[#This Row],[IV-H_Funktionen]]","v":"Musterevent_6"},414,{"$f":"IF(ROW(C414)-ROW(C$382)+1>COUNT(Tab_IVH_ÖffentlPer[IV-H_Zeile]),\"\",INDEX(F:F,SMALL(Tab_IVH_ÖffentlPer[IV-H_Zeile],1+ROW(F414)-ROW($F$382))))","v":""}]
[259,null,{"$f":"B_IV_Vermarktungs_Konzept!$R8","v":"Musterevent_7"},{"$f":"B_IV_Vermarktungs_Konzept!S8","v":"-"},null,{"$f":"Tab_IVH_ÖffentlPer[[#This Row],[IV-H_Funktionen]]","v":"Musterevent_7"},415,{"$f":"IF(ROW(C415)-ROW(C$382)+1>COUNT(Tab_IVH_ÖffentlPer[IV-H_Zeile]),\"\",INDEX(F:F,SMALL(Tab_IVH_ÖffentlPer[IV-H_Zeile],1+ROW(F415)-ROW($F$382))))","v":""}]
[260,null,{"$f":"B_IV_Vermarktungs_Konzept!$R9","v":"Musterevent_8"},{"$f":"B_IV_Vermarktungs_Konzept!S9","v":"-"},null,{"$f":"Tab_IVH_ÖffentlPer[[#This Row],[IV-H_Funktionen]]","v":"Musterevent_8"},416,{"$f":"IF(ROW(C416)-ROW(C$382)+1>COUNT(Tab_IVH_ÖffentlPer[IV-H_Zeile]),\"\",INDEX(F:F,SMALL(Tab_IVH_ÖffentlPer[IV-H_Zeile],1+ROW(F416)-ROW($F$382))))","v":""}]
[261,null,{"$f":"B_IV_Vermarktungs_Konzept!$R10","v":"Musterevent_9"},{"$f":"B_IV_Vermarktungs_Konzept!S10","v":"-"},null,{"$f":"Tab_IVH_ÖffentlPer[[#This Row],[IV-H_Funktionen]]","v":"Musterevent_9"},417,{"$f":"IF(ROW(C417)-ROW(C$382)+1>COUNT(Tab_IVH_ÖffentlPer[IV-H_Zeile]),\"\",INDEX(F:F,SMALL(Tab_IVH_ÖffentlPer[IV-H_Zeile],1+ROW(F417)-ROW($F$382))))","v":""}]
[262,null,{"$f":"B_IV_Vermarktungs_Konzept!$T2","v":"BMar1 - Mitgliederzahlen steigen"},{"$f":"B_IV_Vermarktungs_Konzept!U2","v":"-"},null,{"$f":"Tab_IVH_ÖffentlPer[[#This Row],[IV-H_Funktionen]]","v":"BMar1 - Mitgliederzahlen steigen"},418,{"$f":"IF(ROW(C418)-ROW(C$382)+1>COUNT(Tab_IVH_ÖffentlPer[IV-H_Zeile]),\"\",INDEX(F:F,SMALL(Tab_IVH_ÖffentlPer[IV-H_Zeile],1+ROW(F418)-ROW($F$382))))","v":""}]
[263,null,{"$f":"B_IV_Vermarktungs_Konzept!$T3","v":"BMar2 - Anteil Freiwilligenarbeit steigt"},{"$f":"B_IV_Vermarktungs_Konzept!U3","v":"-"},null,{"$f":"Tab_IVH_ÖffentlPer[[#This Row],[IV-H_Funktionen]]","v":"BMar2 - Anteil Freiwilligenarbeit steigt"},"",{"$f":"IF(ROW(C419)-ROW(C$382)+1>COUNT(Tab_IVH_ÖffentlPer[IV-H_Zeile]),\"\",INDEX(F:F,SMALL(Tab_IVH_ÖffentlPer[IV-H_Zeile],1+ROW(F419)-ROW($F$382))))","v":""}]
[264,null,{"$f":"B_IV_Vermarktungs_Konzept!$T4","v":"BMar3 - Ausschöpfung Marketingkanäle"},{"$f":"B_IV_Vermarktungs_Konzept!U4","v":"-"},null,{"$f":"Tab_IVH_ÖffentlPer[[#This Row],[IV-H_Funktionen]]","v":"BMar3 - Ausschöpfung Marketingkanäle"},"",{"$f":"IF(ROW(C420)-ROW(C$382)+1>COUNT(Tab_IVH_ÖffentlPer[IV-H_Zeile]),\"\",INDEX(F:F,SMALL(Tab_IVH_ÖffentlPer[IV-H_Zeile],1+ROW(F420)-ROW($F$382))))","v":""}]
[265,null,{"$f":"B_IV_Vermarktungs_Konzept!$T5","v":"Bessere Argumente für Subventionen"},{"$f":"B_IV_Vermarktungs_Konzept!U5","v":"-"},null,{"$f":"Tab_IVH_ÖffentlPer[[#This Row],[IV-H_Funktionen]]","v":"Bessere Argumente für Subventionen"},"",{"$f":"IF(ROW(C421)-ROW(C$382)+1>COUNT(Tab_IVH_ÖffentlPer[IV-H_Zeile]),\"\",INDEX(F:F,SMALL(Tab_IVH_ÖffentlPer[IV-H_Zeile],1+ROW(F421)-ROW($F$382))))","v":""}]
[266,null,{"$f":"B_IV_Vermarktungs_Konzept!$T6","v":"Zuschauerzahlen steigen"},{"$f":"B_IV_Vermarktungs_Konzept!U6","v":"-"},null,{"$f":"Tab_IVH_ÖffentlPer[[#This Row],[IV-H_Funktionen]]","v":"Zuschauerzahlen steigen"},"",{"$f":"IF(ROW(C422)-ROW(C$382)+1>COUNT(Tab_IVH_ÖffentlPer[IV-H_Zeile]),\"\",INDEX(F:F,SMALL(Tab_IVH_ÖffentlPer[IV-H_Zeile],1+ROW(F422)-ROW($F$382))))","v":""}]
[267,null,{"$f":"B_IV_Vermarktungs_Konzept!$T7","v":"Soziale Anerkennung steigt"},{"$f":"B_IV_Vermarktungs_Konzept!U7","v":"-"},null,{"$f":"Tab_IVH_ÖffentlPer[[#This Row],[IV-H_Funktionen]]","v":"Soziale Anerkennung steigt"},423,{"$f":"IF(ROW(C423)-ROW(C$382)+1>COUNT(Tab_IVH_ÖffentlPer[IV-H_Zeile]),\"\",INDEX(F:F,SMALL(Tab_IVH_ÖffentlPer[IV-H_Zeile],1+ROW(F423)-ROW($F$382))))","v":""}]
[268,null,{"$f":"B_IV_Vermarktungs_Konzept!$T8","v":"Besserer Zugang zu (lokalen) Sponsoren"},{"$f":"B_IV_Vermarktungs_Konzept!U8","v":"-"},null,{"$f":"Tab_IVH_ÖffentlPer[[#This Row],[IV-H_Funktionen]]","v":"Besserer Zugang zu (lokalen) Sponsoren"},"",{"$f":"IF(ROW(C424)-ROW(C$382)+1>COUNT(Tab_IVH_ÖffentlPer[IV-H_Zeile]),\"\",INDEX(F:F,SMALL(Tab_IVH_ÖffentlPer[IV-H_Zeile],1+ROW(F424)-ROW($F$382))))","v":""}]
[269,null,{"$f":"B_IV_Vermarktungs_Konzept!$T9","v":"Benchmark_8"},{"$f":"B_IV_Vermarktungs_Konzept!U9","v":"-"},null,{"$f":"Tab_IVH_ÖffentlPer[[#This Row],[IV-H_Funktionen]]","v":"Benchmark_8"},425,{"$f":"IF(ROW(C425)-ROW(C$382)+1>COUNT(Tab_IVH_ÖffentlPer[IV-H_Zeile]),\"\",INDEX(F:F,SMALL(Tab_IVH_ÖffentlPer[IV-H_Zeile],1+ROW(F425)-ROW($F$382))))","v":""}]
[270,null,{"$f":"B_IV_Vermarktungs_Konzept!$T10","v":"Benchmark_9"},{"$f":"B_IV_Vermarktungs_Konzept!U10","v":"-"},null,{"$f":"Tab_IVH_ÖffentlPer[[#This Row],[IV-H_Funktionen]]","v":"Benchmark_9"},426,{"$f":"IF(ROW(C426)-ROW(C$382)+1>COUNT(Tab_IVH_ÖffentlPer[IV-H_Zeile]),\"\",INDEX(F:F,SMALL(Tab_IVH_ÖffentlPer[IV-H_Zeile],1+ROW(F426)-ROW($F$382))))","v":""}]
[]
["L_Nr.","IV. Vermarktungskonzept","IV-I_Funktionen","IV-I_Werte","IV-I_100%","IV-I_Funktion","IV-I_Zeile","IV-I_noch möglich"]
[271,{"$f":"B_IV_Vermarktungs_Konzept!$B$6","v":"I. Kommunikationsperspektive"},{"$f":"B_IV_Vermarktungs_Konzept!$L13","v":"Kommunikationsablauf_1"},{"$f":"B_IV_Vermarktungs_Konzept!M13","v":"-"},null,{"$f":"Tab_IVI_KommunikPer[[#This Row],[IV-I_Funktionen]]","v":"Kommunikationsablauf_1"},{"$f":"IF(COUNTIF($C$101:$C$115,F429)>=1,\"\",ROW())","v":""},{"$f":"IF(ROW(C429)-ROW(C$429)+1>COUNT(Tab_IVI_KommunikPer[IV-I_Zeile]),\"\",INDEX(F:F,SMALL(Tab_IVI_KommunikPer[IV-I_Zeile],1+ROW(F429)-ROW($F$429))))","v":"Kommunikationsablauf_2"}]
[272,null,{"$f":"B_IV_Vermarktungs_Konzept!$L14","v":"Kommunikationsablauf_2"},{"$f":"B_IV_Vermarktungs_Konzept!M14","v":"-"},null,{"$f":"Tab_IVI_KommunikPer[[#This Row],[IV-I_Funktionen]]","v":"Kommunikationsablauf_2"},{"$f":"IF(COUNTIF($C$101:$C$115,F430)>=1,\"\",ROW())","v":430},{"$f":"IF(ROW(C430)-ROW(C$429)+1>COUNT(Tab_IVI_KommunikPer[IV-I_Zeile]),\"\",INDEX(F:F,SMALL(Tab_IVI_KommunikPer[IV-I_Zeile],1+ROW(F430)-ROW($F$429))))","v":"Kommunikationsablauf_3"}]
[273,null,{"$f":"B_IV_Vermarktungs_Konzept!$L15","v":"Kommunikationsablauf_3"},{"$f":"B_IV_Vermarktungs_Konzept!M15","v":"-"},null,{"$f":"Tab_IVI_KommunikPer[[#This Row],[IV-I_Funktionen]]","v":"Kommunikationsablauf_3"},431,{"$f":"IF(ROW(C431)-ROW(C$429)+1>COUNT(Tab_IVI_KommunikPer[IV-I_Zeile]),\"\",INDEX(F:F,SMALL(Tab_IVI_KommunikPer[IV-I_Zeile],1+ROW(F431)-ROW($F$429))))","v":"Kommunikationsablauf_4"}]
[274,null,{"$f":"B_IV_Vermarktungs_Konzept!$L16","v":"Kommunikationsablauf_4"},{"$f":"B_IV_Vermarktungs_Konzept!M16","v":"-"},null,{"$f":"Tab_IVI_KommunikPer[[#This Row],[IV-I_Funktionen]]","v":"Kommunikationsablauf_4"},432,{"$f":"IF(ROW(C432)-ROW(C$429)+1>COUNT(Tab_IVI_KommunikPer[IV-I_Zeile]),\"\",INDEX(F:F,SMALL(Tab_IVI_KommunikPer[IV-I_Zeile],1+ROW(F432)-ROW($F$429))))","v":"Kommunikationsablauf_5"}]
[275,null,{"$f":"B_IV_Vermarktungs_Konzept!$L17","v":"Kommunikationsablauf_5"},{"$f":"B_IV_Vermarktungs_Konzept!M17","v":"-"},null,{"$f":"Tab_IVI_KommunikPer[[#This Row],[IV-I_Funktionen]]","v":"Kommunikationsablauf_5"},433,{"$f":"IF(ROW(C433)-ROW(C$429)+1>COUNT(Tab_IVI_KommunikPer[IV-I_Zeile]),\"\",INDEX(F:F,SMALL(Tab_IVI_KommunikPer[IV-I_Zeile],1+ROW(F433)-ROW($F$429))))","v":"Kommunikationsablauf_7"}]
[276,null,{"$f":"B_IV_Vermarktungs_Konzept!$L18","v":"Kommunikationsablauf_6"},{"$f":"B_IV_Vermarktungs_Konzept!M18","v":"-"},null,{"$f":"Tab_IVI_KommunikPer[[#This Row],[IV-I_Funktionen]]","v":"Kommunikationsablauf_6"},"",{"$f":"IF(ROW(C434)-ROW(C$429)+1>COUNT(Tab_IVI_KommunikPer[IV-I_Zeile]),\"\",INDEX(F:F,SMALL(Tab_IVI_KommunikPer[IV-I_Zeile],1+ROW(F434)-ROW($F$429))))","v":"Kommunikationsablauf_8"}]
[277,null,{"$f":"B_IV_Vermarktungs_Konzept!$L19","v":"Kommunikationsablauf_7"},{"$f":"B_IV_Vermarktungs_Konzept!M19","v":"-"},null,{"$f":"Tab_IVI_KommunikPer[[#This Row],[IV-I_Funktionen]]","v":"Kommunikationsablauf_7"},435,{"$f":"IF(ROW(C435)-ROW(C$429)+1>COUNT(Tab_IVI_KommunikPer[IV-I_Zeile]),\"\",INDEX(F:F,SMALL(Tab_IVI_KommunikPer[IV-I_Zeile],1+ROW(F435)-ROW($F$429))))","v":"Kommunikationsablauf_9"}]
[278,null,{"$f":"B_IV_Vermarktungs_Konzept!$L20","v":"Kommunikationsablauf_8"},{"$f":"B_IV_Vermarktungs_Konzept!M20","v":"-"},null,{"$f":"Tab_IVI_KommunikPer[[#This Row],[IV-I_Funktionen]]","v":"Kommunikationsablauf_8"},436,{"$f":"IF(ROW(C436)-ROW(C$429)+1>COUNT(Tab_IVI_KommunikPer[IV-I_Zeile]),\"\",INDEX(F:F,SMALL(Tab_IVI_KommunikPer[IV-I_Zeile],1+ROW(F436)-ROW($F$429))))","v":"Kommunikation Heute_3"}]
[279,null,{"$f":"B_IV_Vermarktungs_Konzept!$L21","v":"Kommunikationsablauf_9"},{"$f":"B_IV_Vermarktungs_Konzept!M21","v":"-"},null,{"$f":"Tab_IVI_KommunikPer[[#This Row],[IV-I_Funktionen]]","v":"Kommunikationsablauf_9"},437,{"$f":"IF(ROW(C437)-ROW(C$429)+1>COUNT(Tab_IVI_KommunikPer[IV-I_Zeile]),\"\",INDEX(F:F,SMALL(Tab_IVI_KommunikPer[IV-I_Zeile],1+ROW(F437)-ROW($F$429))))","v":"Kommunikation Heute_4"}]
[280,null,{"$f":"B_IV_Vermarktungs_Konzept!$N13","v":"Kommunikation Heute"},{"$f":"B_IV_Vermarktungs_Konzept!O13","v":"-"},null,{"$f":"Tab_IVI_KommunikPer[[#This Row],[IV-I_Funktionen]]","v":"Kommunikation Heute"},"",{"$f":"IF(ROW(C438)-ROW(C$429)+1>COUNT(Tab_IVI_KommunikPer[IV-I_Zeile]),\"\",INDEX(F:F,SMALL(Tab_IVI_KommunikPer[IV-I_Zeile],1+ROW(F438)-ROW($F$429))))","v":"Kommunikation Heute_5"}]
[281,null,{"$f":"B_IV_Vermarktungs_Konzept!$N14","v":"Soziale Medien "},{"$f":"B_IV_Vermarktungs_Konzept!O14","v":"-"},null,{"$f":"Tab_IVI_KommunikPer[[#This Row],[IV-I_Funktionen]]","v":"Soziale Medien "},"",{"$f":"IF(ROW(C439)-ROW(C$429)+1>COUNT(Tab_IVI_KommunikPer[IV-I_Zeile]),\"\",INDEX(F:F,SMALL(Tab_IVI_KommunikPer[IV-I_Zeile],1+ROW(F439)-ROW($F$429))))","v":"Kommunikation Heute_6"}]
[282,null,{"$f":"B_IV_Vermarktungs_Konzept!$N15","v":"Kommunikation Heute_3"},{"$f":"B_IV_Vermarktungs_Konzept!O15","v":"-"},null,{"$f":"Tab_IVI_KommunikPer[[#This Row],[IV-I_Funktionen]]","v":"Kommunikation Heute_3"},440,{"$f":"IF(ROW(C440)-ROW(C$429)+1>COUNT(Tab_IVI_KommunikPer[IV-I_Zeile]),\"\",INDEX(F:F,SMALL(Tab_IVI_KommunikPer[IV-I_Zeile],1+ROW(F440)-ROW($F$429))))","v":"Kommunikation Heute_7"}]
[283,null,{"$f":"B_IV_Vermarktungs_Konzept!$N16","v":"Kommunikation Heute_4"},{"$f":"B_IV_Vermarktungs_Konzept!O16","v":"-"},null,{"$f":"Tab_IVI_KommunikPer[[#This Row],[IV-I_Funktionen]]","v":"Kommunikation Heute_4"},441,{"$f":"IF(ROW(C441)-ROW(C$429)+1>COUNT(Tab_IVI_KommunikPer[IV-I_Zeile]),\"\",INDEX(F:F,SMALL(Tab_IVI_KommunikPer[IV-I_Zeile],1+ROW(F441)-ROW($F$429))))","v":"Kommunikation Heute_8"}]
[284,null,{"$f":"B_IV_Vermarktungs_Konzept!$N17","v":"Kommunikation Heute_5"},{"$f":"B_IV_Vermarktungs_Konzept!O17","v":"-"},null,{"$f":"Tab_IVI_KommunikPer[[#This Row],[IV-I_Funktionen]]","v":"Kommunikation Heute_5"},442,{"$f":"IF(ROW(C442)-ROW(C$429)+1>COUNT(Tab_IVI_KommunikPer[IV-I_Zeile]),\"\",INDEX(F:F,SMALL(Tab_IVI_KommunikPer[IV-I_Zeile],1+ROW(F442)-ROW($F$429))))","v":"Wen möchte ich erreichen"}]
[285,null,{"$f":"B_IV_Vermarktungs_Konzept!$N18","v":"Kommunikation Heute_6"},{"$f":"B_IV_Vermarktungs_Konzept!O18","v":"-"},null,{"$f":"Tab_IVI_KommunikPer[[#This Row],[IV-I_Funktionen]]","v":"Kommunikation Heute_6"},443,{"$f":"IF(ROW(C443)-ROW(C$429)+1>COUNT(Tab_IVI_KommunikPer[IV-I_Zeile]),\"\",INDEX(F:F,SMALL(Tab_IVI_KommunikPer[IV-I_Zeile],1+ROW(F443)-ROW($F$429))))","v":"Was ist anders, wenn wir gut kommunizieren"}]
[286,null,{"$f":"B_IV_Vermarktungs_Konzept!$N19","v":"Kommunikation Heute_7"},{"$f":"B_IV_Vermarktungs_Konzept!O19","v":"-"},null,{"$f":"Tab_IVI_KommunikPer[[#This Row],[IV-I_Funktionen]]","v":"Kommunikation Heute_7"},444,{"$f":"IF(ROW(C444)-ROW(C$429)+1>COUNT(Tab_IVI_KommunikPer[IV-I_Zeile]),\"\",INDEX(F:F,SMALL(Tab_IVI_KommunikPer[IV-I_Zeile],1+ROW(F444)-ROW($F$429))))","v":"leer"}]
[287,null,{"$f":"B_IV_Vermarktungs_Konzept!$N20","v":"Kommunikation Heute_8"},{"$f":"B_IV_Vermarktungs_Konzept!O20","v":"-"},null,{"$f":"Tab_IVI_KommunikPer[[#This Row],[IV-I_Funktionen]]","v":"Kommunikation Heute_8"},445,{"$f":"IF(ROW(C445)-ROW(C$429)+1>COUNT(Tab_IVI_KommunikPer[IV-I_Zeile]),\"\",INDEX(F:F,SMALL(Tab_IVI_KommunikPer[IV-I_Zeile],1+ROW(F445)-ROW($F$429))))","v":"leer"}]
[288,null,{"$f":"B_IV_Vermarktungs_Konzept!$N21","v":"Kommunikation Heute_9"},{"$f":"B_IV_Vermarktungs_Konzept!O21","v":"-"},null,{"$f":"Tab_IVI_KommunikPer[[#This Row],[IV-I_Funktionen]]","v":"Kommunikation Heute_9"},"",{"$f":"IF(ROW(C446)-ROW(C$429)+1>COUNT(Tab_IVI_KommunikPer[IV-I_Zeile]),\"\",INDEX(F:F,SMALL(Tab_IVI_KommunikPer[IV-I_Zeile],1+ROW(F446)-ROW($F$429))))","v":"leer"}]
[289,null,{"$f":"B_IV_Vermarktungs_Konzept!$P13","v":"Was möchte ich mit Kom. erreichen"},{"$f":"B_IV_Vermarktungs_Konzept!Q13","v":"-"},null,{"$f":"Tab_IVI_KommunikPer[[#This Row],[IV-I_Funktionen]]","v":"Was möchte ich mit Kom. erreichen"},"",{"$f":"IF(ROW(C447)-ROW(C$429)+1>COUNT(Tab_IVI_KommunikPer[IV-I_Zeile]),\"\",INDEX(F:F,SMALL(Tab_IVI_KommunikPer[IV-I_Zeile],1+ROW(F447)-ROW($F$429))))","v":"Kommunikation Innen/Außen_3"}]
[290,null,{"$f":"B_IV_Vermarktungs_Konzept!$P14","v":"Warum ist mir Kommunikation wichtig"},{"$f":"B_IV_Vermarktungs_Konzept!Q14","v":"-"},null,{"$f":"Tab_IVI_KommunikPer[[#This Row],[IV-I_Funktionen]]","v":"Warum ist mir Kommunikation wichtig"},"",{"$f":"IF(ROW(C448)-ROW(C$429)+1>COUNT(Tab_IVI_KommunikPer[IV-I_Zeile]),\"\",INDEX(F:F,SMALL(Tab_IVI_KommunikPer[IV-I_Zeile],1+ROW(F448)-ROW($F$429))))","v":"Kommunikation Innen/Außen_4"}]
[291,null,{"$f":"B_IV_Vermarktungs_Konzept!$P15","v":"Wen möchte ich erreichen"},{"$f":"B_IV_Vermarktungs_Konzept!Q15","v":"-"},null,{"$f":"Tab_IVI_KommunikPer[[#This Row],[IV-I_Funktionen]]","v":"Wen möchte ich erreichen"},449,{"$f":"IF(ROW(C449)-ROW(C$429)+1>COUNT(Tab_IVI_KommunikPer[IV-I_Zeile]),\"\",INDEX(F:F,SMALL(Tab_IVI_KommunikPer[IV-I_Zeile],1+ROW(F449)-ROW($F$429))))","v":"Kommunikation Innen/Außen_6"}]
[292,null,{"$f":"B_IV_Vermarktungs_Konzept!$P16","v":"Wer ist meine Ziel-/Dialoggruppe"},{"$f":"B_IV_Vermarktungs_Konzept!Q16","v":"-"},null,{"$f":"Tab_IVI_KommunikPer[[#This Row],[IV-I_Funktionen]]","v":"Wer ist meine Ziel-/Dialoggruppe"},"",{"$f":"IF(ROW(C450)-ROW(C$429)+1>COUNT(Tab_IVI_KommunikPer[IV-I_Zeile]),\"\",INDEX(F:F,SMALL(Tab_IVI_KommunikPer[IV-I_Zeile],1+ROW(F450)-ROW($F$429))))","v":"Kommunikation Innen/Außen_7"}]
[293,null,{"$f":"B_IV_Vermarktungs_Konzept!$P17","v":"Was ist der Neuigkeitswert"},{"$f":"B_IV_Vermarktungs_Konzept!Q17","v":"-"},null,{"$f":"Tab_IVI_KommunikPer[[#This Row],[IV-I_Funktionen]]","v":"Was ist der Neuigkeitswert"},"",{"$f":"IF(ROW(C451)-ROW(C$429)+1>COUNT(Tab_IVI_KommunikPer[IV-I_Zeile]),\"\",INDEX(F:F,SMALL(Tab_IVI_KommunikPer[IV-I_Zeile],1+ROW(F451)-ROW($F$429))))","v":"Kommunikation Innen/Außen_8"}]
[294,null,{"$f":"B_IV_Vermarktungs_Konzept!$P18","v":"Was ist anders, wenn wir gut kommunizieren"},{"$f":"B_IV_Vermarktungs_Konzept!Q18","v":"-"},null,{"$f":"Tab_IVI_KommunikPer[[#This Row],[IV-I_Funktionen]]","v":"Was ist anders, wenn wir gut kommunizieren"},452,{"$f":"IF(ROW(C452)-ROW(C$429)+1>COUNT(Tab_IVI_KommunikPer[IV-I_Zeile]),\"\",INDEX(F:F,SMALL(Tab_IVI_KommunikPer[IV-I_Zeile],1+ROW(F452)-ROW($F$429))))","v":"Kommunikation Innen/Außen_9"}]
[295,null,{"$f":"B_IV_Vermarktungs_Konzept!$P19","v":"leer"},{"$f":"B_IV_Vermarktungs_Konzept!Q19","v":"-"},null,{"$f":"Tab_IVI_KommunikPer[[#This Row],[IV-I_Funktionen]]","v":"leer"},453,{"$f":"IF(ROW(C453)-ROW(C$429)+1>COUNT(Tab_IVI_KommunikPer[IV-I_Zeile]),\"\",INDEX(F:F,SMALL(Tab_IVI_KommunikPer[IV-I_Zeile],1+ROW(F453)-ROW($F$429))))","v":"Pressearbeit_2"}]
[296,null,{"$f":"B_IV_Vermarktungs_Konzept!$P20","v":"leer"},{"$f":"B_IV_Vermarktungs_Konzept!Q20","v":"-"},null,{"$f":"Tab_IVI_KommunikPer[[#This Row],[IV-I_Funktionen]]","v":"leer"},454,{"$f":"IF(ROW(C454)-ROW(C$429)+1>COUNT(Tab_IVI_KommunikPer[IV-I_Zeile]),\"\",INDEX(F:F,SMALL(Tab_IVI_KommunikPer[IV-I_Zeile],1+ROW(F454)-ROW($F$429))))","v":"Pressearbeit_3"}]
[297,null,{"$f":"B_IV_Vermarktungs_Konzept!$P21","v":"leer"},{"$f":"B_IV_Vermarktungs_Konzept!Q21","v":"-"},null,{"$f":"Tab_IVI_KommunikPer[[#This Row],[IV-I_Funktionen]]","v":"leer"},455,{"$f":"IF(ROW(C455)-ROW(C$429)+1>COUNT(Tab_IVI_KommunikPer[IV-I_Zeile]),\"\",INDEX(F:F,SMALL(Tab_IVI_KommunikPer[IV-I_Zeile],1+ROW(F455)-ROW($F$429))))","v":"Pressearbeit_4"}]
[298,null,{"$f":"B_IV_Vermarktungs_Konzept!$R13","v":"Kommunikation nach Innen"},{"$f":"B_IV_Vermarktungs_Konzept!S13","v":"-"},null,{"$f":"Tab_IVI_KommunikPer[[#This Row],[IV-I_Funktionen]]","v":"Kommunikation nach Innen"},"",{"$f":"IF(ROW(C456)-ROW(C$429)+1>COUNT(Tab_IVI_KommunikPer[IV-I_Zeile]),\"\",INDEX(F:F,SMALL(Tab_IVI_KommunikPer[IV-I_Zeile],1+ROW(F456)-ROW($F$429))))","v":"Pressearbeit_5"}]
[299,null,{"$f":"B_IV_Vermarktungs_Konzept!$R14","v":"Kommunikation nach Außen"},{"$f":"B_IV_Vermarktungs_Konzept!S14","v":"-"},null,{"$f":"Tab_IVI_KommunikPer[[#This Row],[IV-I_Funktionen]]","v":"Kommunikation nach Außen"},"",{"$f":"IF(ROW(C457)-ROW(C$429)+1>COUNT(Tab_IVI_KommunikPer[IV-I_Zeile]),\"\",INDEX(F:F,SMALL(Tab_IVI_KommunikPer[IV-I_Zeile],1+ROW(F457)-ROW($F$429))))","v":"Pressearbeit_7"}]
[300,null,{"$f":"B_IV_Vermarktungs_Konzept!$R15","v":"Kommunikation Innen/Außen_3"},{"$f":"B_IV_Vermarktungs_Konzept!S15","v":"-"},null,{"$f":"Tab_IVI_KommunikPer[[#This Row],[IV-I_Funktionen]]","v":"Kommunikation Innen/Außen_3"},458,{"$f":"IF(ROW(C458)-ROW(C$429)+1>COUNT(Tab_IVI_KommunikPer[IV-I_Zeile]),\"\",INDEX(F:F,SMALL(Tab_IVI_KommunikPer[IV-I_Zeile],1+ROW(F458)-ROW($F$429))))","v":"Pressearbeit_9"}]
[301,null,{"$f":"B_IV_Vermarktungs_Konzept!$R16","v":"Kommunikation Innen/Außen_4"},{"$f":"B_IV_Vermarktungs_Konzept!S16","v":"-"},null,{"$f":"Tab_IVI_KommunikPer[[#This Row],[IV-I_Funktionen]]","v":"Kommunikation Innen/Außen_4"},459,{"$f":"IF(ROW(C459)-ROW(C$429)+1>COUNT(Tab_IVI_KommunikPer[IV-I_Zeile]),\"\",INDEX(F:F,SMALL(Tab_IVI_KommunikPer[IV-I_Zeile],1+ROW(F459)-ROW($F$429))))","v":""}]
[302,null,{"$f":"B_IV_Vermarktungs_Konzept!$R17","v":"Kommunikation Innen/Außen_5"},{"$f":"B_IV_Vermarktungs_Konzept!S17","v":"-"},null,{"$f":"Tab_IVI_KommunikPer[[#This Row],[IV-I_Funktionen]]","v":"Kommunikation Innen/Außen_5"},"",{"$f":"IF(ROW(C460)-ROW(C$429)+1>COUNT(Tab_IVI_KommunikPer[IV-I_Zeile]),\"\",INDEX(F:F,SMALL(Tab_IVI_KommunikPer[IV-I_Zeile],1+ROW(F460)-ROW($F$429))))","v":""}]
[303,null,{"$f":"B_IV_Vermarktungs_Konzept!$R18","v":"Kommunikation Innen/Außen_6"},{"$f":"B_IV_Vermarktungs_Konzept!S18","v":"-"},null,{"$f":"Tab_IVI_KommunikPer[[#This Row],[IV-I_Funktionen]]","v":"Kommunikation Innen/Außen_6"},461,{"$f":"IF(ROW(C461)-ROW(C$429)+1>COUNT(Tab_IVI_KommunikPer[IV-I_Zeile]),\"\",INDEX(F:F,SMALL(Tab_IVI_KommunikPer[IV-I_Zeile],1+ROW(F461)-ROW($F$429))))","v":""}]
[304,null,{"$f":"B_IV_Vermarktungs_Konzept!$R19","v":"Kommunikation Innen/Außen_7"},{"$f":"B_IV_Vermarktungs_Konzept!S19","v":"-"},null,{"$f":"Tab_IVI_KommunikPer[[#This Row],[IV-I_Funktionen]]","v":"Kommunikation Innen/Außen_7"},462,{"$f":"IF(ROW(C462)-ROW(C$429)+1>COUNT(Tab_IVI_KommunikPer[IV-I_Zeile]),\"\",INDEX(F:F,SMALL(Tab_IVI_KommunikPer[IV-I_Zeile],1+ROW(F462)-ROW($F$429))))","v":""}]
[305,null,{"$f":"B_IV_Vermarktungs_Konzept!$R20","v":"Kommunikation Innen/Außen_8"},{"$f":"B_IV_Vermarktungs_Konzept!S20","v":"-"},null,{"$f":"Tab_IVI_KommunikPer[[#This Row],[IV-I_Funktionen]]","v":"Kommunikation Innen/Außen_8"},463,{"$f":"IF(ROW(C463)-ROW(C$429)+1>COUNT(Tab_IVI_KommunikPer[IV-I_Zeile]),\"\",INDEX(F:F,SMALL(Tab_IVI_KommunikPer[IV-I_Zeile],1+ROW(F463)-ROW($F$429))))","v":""}]
[306,null,{"$f":"B_IV_Vermarktungs_Konzept!$R21","v":"Kommunikation Innen/Außen_9"},{"$f":"B_IV_Vermarktungs_Konzept!S21","v":"-"},null,{"$f":"Tab_IVI_KommunikPer[[#This Row],[IV-I_Funktionen]]","v":"Kommunikation Innen/Außen_9"},464,{"$f":"IF(ROW(C464)-ROW(C$429)+1>COUNT(Tab_IVI_KommunikPer[IV-I_Zeile]),\"\",INDEX(F:F,SMALL(Tab_IVI_KommunikPer[IV-I_Zeile],1+ROW(F464)-ROW($F$429))))","v":""}]
[307,null,{"$f":"B_IV_Vermarktungs_Konzept!$T13","v":"Pressearbeit_1"},{"$f":"B_IV_Vermarktungs_Konzept!U13","v":"-"},null,{"$f":"Tab_IVI_KommunikPer[[#This Row],[IV-I_Funktionen]]","v":"Pressearbeit_1"},"",{"$f":"IF(ROW(C465)-ROW(C$429)+1>COUNT(Tab_IVI_KommunikPer[IV-I_Zeile]),\"\",INDEX(F:F,SMALL(Tab_IVI_KommunikPer[IV-I_Zeile],1+ROW(F465)-ROW($F$429))))","v":""}]
[308,null,{"$f":"B_IV_Vermarktungs_Konzept!$T14","v":"Pressearbeit_2"},{"$f":"B_IV_Vermarktungs_Konzept!U14","v":"-"},null,{"$f":"Tab_IVI_KommunikPer[[#This Row],[IV-I_Funktionen]]","v":"Pressearbeit_2"},466,{"$f":"IF(ROW(C466)-ROW(C$429)+1>COUNT(Tab_IVI_KommunikPer[IV-I_Zeile]),\"\",INDEX(F:F,SMALL(Tab_IVI_KommunikPer[IV-I_Zeile],1+ROW(F466)-ROW($F$429))))","v":""}]
[309,null,{"$f":"B_IV_Vermarktungs_Konzept!$T15","v":"Pressearbeit_3"},{"$f":"B_IV_Vermarktungs_Konzept!U15","v":"-"},null,{"$f":"Tab_IVI_KommunikPer[[#This Row],[IV-I_Funktionen]]","v":"Pressearbeit_3"},467,{"$f":"IF(ROW(C467)-ROW(C$429)+1>COUNT(Tab_IVI_KommunikPer[IV-I_Zeile]),\"\",INDEX(F:F,SMALL(Tab_IVI_KommunikPer[IV-I_Zeile],1+ROW(F467)-ROW($F$429))))","v":""}]
[310,null,{"$f":"B_IV_Vermarktungs_Konzept!$T16","v":"Pressearbeit_4"},{"$f":"B_IV_Vermarktungs_Konzept!U16","v":"-"},null,{"$f":"Tab_IVI_KommunikPer[[#This Row],[IV-I_Funktionen]]","v":"Pressearbeit_4"},468,{"$f":"IF(ROW(C468)-ROW(C$429)+1>COUNT(Tab_IVI_KommunikPer[IV-I_Zeile]),\"\",INDEX(F:F,SMALL(Tab_IVI_KommunikPer[IV-I_Zeile],1+ROW(F468)-ROW($F$429))))","v":""}]
[311,null,{"$f":"B_IV_Vermarktungs_Konzept!$T17","v":"Pressearbeit_5"},{"$f":"B_IV_Vermarktungs_Konzept!U17","v":"-"},null,{"$f":"Tab_IVI_KommunikPer[[#This Row],[IV-I_Funktionen]]","v":"Pressearbeit_5"},469,{"$f":"IF(ROW(C469)-ROW(C$429)+1>COUNT(Tab_IVI_KommunikPer[IV-I_Zeile]),\"\",INDEX(F:F,SMALL(Tab_IVI_KommunikPer[IV-I_Zeile],1+ROW(F469)-ROW($F$429))))","v":""}]
[312,null,{"$f":"B_IV_Vermarktungs_Konzept!$T18","v":"Pressearbeit_6"},{"$f":"B_IV_Vermarktungs_Konzept!U18","v":"-"},null,{"$f":"Tab_IVI_KommunikPer[[#This Row],[IV-I_Funktionen]]","v":"Pressearbeit_6"},"",{"$f":"IF(ROW(C470)-ROW(C$429)+1>COUNT(Tab_IVI_KommunikPer[IV-I_Zeile]),\"\",INDEX(F:F,SMALL(Tab_IVI_KommunikPer[IV-I_Zeile],1+ROW(F470)-ROW($F$429))))","v":""}]
[313,null,{"$f":"B_IV_Vermarktungs_Konzept!$T19","v":"Pressearbeit_7"},{"$f":"B_IV_Vermarktungs_Konzept!U19","v":"-"},null,{"$f":"Tab_IVI_KommunikPer[[#This Row],[IV-I_Funktionen]]","v":"Pressearbeit_7"},471,{"$f":"IF(ROW(C471)-ROW(C$429)+1>COUNT(Tab_IVI_KommunikPer[IV-I_Zeile]),\"\",INDEX(F:F,SMALL(Tab_IVI_KommunikPer[IV-I_Zeile],1+ROW(F471)-ROW($F$429))))","v":""}]
[314,null,{"$f":"B_IV_Vermarktungs_Konzept!$T20","v":"Pressearbeit_8"},{"$f":"B_IV_Vermarktungs_Konzept!U20","v":"-"},null,{"$f":"Tab_IVI_KommunikPer[[#This Row],[IV-I_Funktionen]]","v":"Pressearbeit_8"},"",{"$f":"IF(ROW(C472)-ROW(C$429)+1>COUNT(Tab_IVI_KommunikPer[IV-I_Zeile]),\"\",INDEX(F:F,SMALL(Tab_IVI_KommunikPer[IV-I_Zeile],1+ROW(F472)-ROW($F$429))))","v":""}]
[315,null,{"$f":"B_IV_Vermarktungs_Konzept!$T21","v":"Pressearbeit_9"},{"$f":"B_IV_Vermarktungs_Konzept!U21","v":"-"},null,{"$f":"Tab_IVI_KommunikPer[[#This Row],[IV-I_Funktionen]]","v":"Pressearbeit_9"},473,{"$f":"IF(ROW(C473)-ROW(C$429)+1>COUNT(Tab_IVI_KommunikPer[IV-I_Zeile]),\"\",INDEX(F:F,SMALL(Tab_IVI_KommunikPer[IV-I_Zeile],1+ROW(F473)-ROW($F$429))))","v":""}]
[]
["L_Nr.","IV. Vermarktungskonzept","IV-J_Funktionen","IV-J_Werte","IV-J_100%","IV-J_Funktion","IV-J_Zeile","IV-J_noch möglich"]
[316,{"$f":"B_IV_Vermarktungs_Konzept!$B$7","v":"J. Marketingperspektive"},{"$f":"B_IV_Vermarktungs_Konzept!$L24","v":"Wo steht der Verein"},{"$f":"B_IV_Vermarktungs_Konzept!M24","v":"-"},null,{"$f":"Tab_IVJ_MarketingPer[[#This Row],[IV-J_Funktionen]]","v":"Wo steht der Verein"},{"$f":"IF(COUNTIF($C$116:$C$130,F476)>=1,\"\",ROW())","v":""},{"$f":"IF(ROW(C476)-ROW(C$476)+1>COUNT(Tab_IVJ_MarketingPer[IV-J_Zeile]),\"\",INDEX(F:F,SMALL(Tab_IVJ_MarketingPer[IV-J_Zeile],1+ROW(F476)-ROW($F$476))))","v":"Wohin will der Verein"}]
[317,null,{"$f":"B_IV_Vermarktungs_Konzept!$L25","v":"Wohin will der Verein"},{"$f":"B_IV_Vermarktungs_Konzept!M25","v":"-"},null,{"$f":"Tab_IVJ_MarketingPer[[#This Row],[IV-J_Funktionen]]","v":"Wohin will der Verein"},477,{"$f":"IF(ROW(C477)-ROW(C$476)+1>COUNT(Tab_IVJ_MarketingPer[IV-J_Zeile]),\"\",INDEX(F:F,SMALL(Tab_IVJ_MarketingPer[IV-J_Zeile],1+ROW(F477)-ROW($F$476))))","v":"Wie kommt man dort hin"}]
[318,null,{"$f":"B_IV_Vermarktungs_Konzept!$L26","v":"Wie kommt man dort hin"},{"$f":"B_IV_Vermarktungs_Konzept!M26","v":"-"},null,{"$f":"Tab_IVJ_MarketingPer[[#This Row],[IV-J_Funktionen]]","v":"Wie kommt man dort hin"},478,{"$f":"IF(ROW(C478)-ROW(C$476)+1>COUNT(Tab_IVJ_MarketingPer[IV-J_Zeile]),\"\",INDEX(F:F,SMALL(Tab_IVJ_MarketingPer[IV-J_Zeile],1+ROW(F478)-ROW($F$476))))","v":"Welche Mittel stehen zur Verfügung"}]
[319,null,{"$f":"B_IV_Vermarktungs_Konzept!$L27","v":"Welche Mittel stehen zur Verfügung"},{"$f":"B_IV_Vermarktungs_Konzept!M27","v":"-"},null,{"$f":"Tab_IVJ_MarketingPer[[#This Row],[IV-J_Funktionen]]","v":"Welche Mittel stehen zur Verfügung"},479,{"$f":"IF(ROW(C479)-ROW(C$476)+1>COUNT(Tab_IVJ_MarketingPer[IV-J_Zeile]),\"\",INDEX(F:F,SMALL(Tab_IVJ_MarketingPer[IV-J_Zeile],1+ROW(F479)-ROW($F$476))))","v":"Wie sieht der Plan/Konzept aus"}]
[320,null,{"$f":"B_IV_Vermarktungs_Konzept!$L28","v":"Wie sieht der Plan/Konzept aus"},{"$f":"B_IV_Vermarktungs_Konzept!M28","v":"-"},null,{"$f":"Tab_IVJ_MarketingPer[[#This Row],[IV-J_Funktionen]]","v":"Wie sieht der Plan/Konzept aus"},480,{"$f":"IF(ROW(C480)-ROW(C$476)+1>COUNT(Tab_IVJ_MarketingPer[IV-J_Zeile]),\"\",INDEX(F:F,SMALL(Tab_IVJ_MarketingPer[IV-J_Zeile],1+ROW(F480)-ROW($F$476))))","v":"Evaluierung am Ende des Zyklus"}]
[321,null,{"$f":"B_IV_Vermarktungs_Konzept!$L29","v":"Umsetzung des Plans/Konzeptes"},{"$f":"B_IV_Vermarktungs_Konzept!M29","v":"-"},null,{"$f":"Tab_IVJ_MarketingPer[[#This Row],[IV-J_Funktionen]]","v":"Umsetzung des Plans/Konzeptes"},"",{"$f":"IF(ROW(C481)-ROW(C$476)+1>COUNT(Tab_IVJ_MarketingPer[IV-J_Zeile]),\"\",INDEX(F:F,SMALL(Tab_IVJ_MarketingPer[IV-J_Zeile],1+ROW(F481)-ROW($F$476))))","v":"Marketingabteilung vorhanden"}]
[322,null,{"$f":"B_IV_Vermarktungs_Konzept!$L30","v":"Kontrollen während der Umsetzung"},{"$f":"B_IV_Vermarktungs_Konzept!M30","v":"-"},null,{"$f":"Tab_IVJ_MarketingPer[[#This Row],[IV-J_Funktionen]]","v":"Kontrollen während der Umsetzung"},"",{"$f":"IF(ROW(C482)-ROW(C$476)+1>COUNT(Tab_IVJ_MarketingPer[IV-J_Zeile]),\"\",INDEX(F:F,SMALL(Tab_IVJ_MarketingPer[IV-J_Zeile],1+ROW(F482)-ROW($F$476))))","v":"Online Marketing Maßnahmen aktuell"}]
[323,null,{"$f":"B_IV_Vermarktungs_Konzept!$L31","v":"Evaluierung am Ende des Zyklus"},{"$f":"B_IV_Vermarktungs_Konzept!M31","v":"-"},null,{"$f":"Tab_IVJ_MarketingPer[[#This Row],[IV-J_Funktionen]]","v":"Evaluierung am Ende des Zyklus"},483,{"$f":"IF(ROW(C483)-ROW(C$476)+1>COUNT(Tab_IVJ_MarketingPer[IV-J_Zeile]),\"\",INDEX(F:F,SMALL(Tab_IVJ_MarketingPer[IV-J_Zeile],1+ROW(F483)-ROW($F$476))))","v":"Online Marketing Ziele"}]
[324,null,{"$f":"B_IV_Vermarktungs_Konzept!$L32","v":"Ergebnisse als Basis des nächsten Zyklus"},{"$f":"B_IV_Vermarktungs_Konzept!M32","v":"-"},null,{"$f":"Tab_IVJ_MarketingPer[[#This Row],[IV-J_Funktionen]]","v":"Ergebnisse als Basis des nächsten Zyklus"},"",{"$f":"IF(ROW(C484)-ROW(C$476)+1>COUNT(Tab_IVJ_MarketingPer[IV-J_Zeile]),\"\",INDEX(F:F,SMALL(Tab_IVJ_MarketingPer[IV-J_Zeile],1+ROW(F484)-ROW($F$476))))","v":"Vereins(Marken)-Bekanntheit"}]
[325,null,{"$f":"B_IV_Vermarktungs_Konzept!$N24","v":"Marketingabteilung vorhanden"},{"$f":"B_IV_Vermarktungs_Konzept!O24","v":"-"},null,{"$f":"Tab_IVJ_MarketingPer[[#This Row],[IV-J_Funktionen]]","v":"Marketingabteilung vorhanden"},485,{"$f":"IF(ROW(C485)-ROW(C$476)+1>COUNT(Tab_IVJ_MarketingPer[IV-J_Zeile]),\"\",INDEX(F:F,SMALL(Tab_IVJ_MarketingPer[IV-J_Zeile],1+ROW(F485)-ROW($F$476))))","v":"Außendarstellung, Werte vermitteln"}]
[326,null,{"$f":"B_IV_Vermarktungs_Konzept!$N25","v":"Online Marketing Maßnahmen aktuell"},{"$f":"B_IV_Vermarktungs_Konzept!O25","v":"-"},null,{"$f":"Tab_IVJ_MarketingPer[[#This Row],[IV-J_Funktionen]]","v":"Online Marketing Maßnahmen aktuell"},486,{"$f":"IF(ROW(C486)-ROW(C$476)+1>COUNT(Tab_IVJ_MarketingPer[IV-J_Zeile]),\"\",INDEX(F:F,SMALL(Tab_IVJ_MarketingPer[IV-J_Zeile],1+ROW(F486)-ROW($F$476))))","v":"CM-Leistungesangebot definieren"}]
[327,null,{"$f":"B_IV_Vermarktungs_Konzept!$N26","v":"Online Marketing Ziele"},{"$f":"B_IV_Vermarktungs_Konzept!O26","v":"-"},null,{"$f":"Tab_IVJ_MarketingPer[[#This Row],[IV-J_Funktionen]]","v":"Online Marketing Ziele"},487,{"$f":"IF(ROW(C487)-ROW(C$476)+1>COUNT(Tab_IVJ_MarketingPer[IV-J_Zeile]),\"\",INDEX(F:F,SMALL(Tab_IVJ_MarketingPer[IV-J_Zeile],1+ROW(F487)-ROW($F$476))))","v":"CM- Evaluieren"}]
[328,null,{"$f":"B_IV_Vermarktungs_Konzept!$N27","v":"Vereins(Marken)-Bekanntheit"},{"$f":"B_IV_Vermarktungs_Konzept!O27","v":"-"},null,{"$f":"Tab_IVJ_MarketingPer[[#This Row],[IV-J_Funktionen]]","v":"Vereins(Marken)-Bekanntheit"},488,{"$f":"IF(ROW(C488)-ROW(C$476)+1>COUNT(Tab_IVJ_MarketingPer[IV-J_Zeile]),\"\",INDEX(F:F,SMALL(Tab_IVJ_MarketingPer[IV-J_Zeile],1+ROW(F488)-ROW($F$476))))","v":"CM-Zielgruppe u. Angebot erweitern"}]
[329,null,{"$f":"B_IV_Vermarktungs_Konzept!$N28","v":"Außendarstellung, Werte vermitteln"},{"$f":"B_IV_Vermarktungs_Konzept!O28","v":"-"},null,{"$f":"Tab_IVJ_MarketingPer[[#This Row],[IV-J_Funktionen]]","v":"Außendarstellung, Werte vermitteln"},489,{"$f":"IF(ROW(C489)-ROW(C$476)+1>COUNT(Tab_IVJ_MarketingPer[IV-J_Zeile]),\"\",INDEX(F:F,SMALL(Tab_IVJ_MarketingPer[IV-J_Zeile],1+ROW(F489)-ROW($F$476))))","v":"Infrastruktur"}]
[330,null,{"$f":"B_IV_Vermarktungs_Konzept!$N29","v":"CM-Zielgruppe definieren"},{"$f":"B_IV_Vermarktungs_Konzept!O29","v":"-"},null,{"$f":"Tab_IVJ_MarketingPer[[#This Row],[IV-J_Funktionen]]","v":"CM-Zielgruppe definieren"},"",{"$f":"IF(ROW(C490)-ROW(C$476)+1>COUNT(Tab_IVJ_MarketingPer[IV-J_Zeile]),\"\",INDEX(F:F,SMALL(Tab_IVJ_MarketingPer[IV-J_Zeile],1+ROW(F490)-ROW($F$476))))","v":"Kleidung, Dressen, "}]
[331,null,{"$f":"B_IV_Vermarktungs_Konzept!$N30","v":"CM-Leistungesangebot definieren"},{"$f":"B_IV_Vermarktungs_Konzept!O30","v":"-"},null,{"$f":"Tab_IVJ_MarketingPer[[#This Row],[IV-J_Funktionen]]","v":"CM-Leistungesangebot definieren"},491,{"$f":"IF(ROW(C491)-ROW(C$476)+1>COUNT(Tab_IVJ_MarketingPer[IV-J_Zeile]),\"\",INDEX(F:F,SMALL(Tab_IVJ_MarketingPer[IV-J_Zeile],1+ROW(F491)-ROW($F$476))))","v":"Spiel"}]
[332,null,{"$f":"B_IV_Vermarktungs_Konzept!$N31","v":"CM- Evaluieren"},{"$f":"B_IV_Vermarktungs_Konzept!O31","v":"-"},null,{"$f":"Tab_IVJ_MarketingPer[[#This Row],[IV-J_Funktionen]]","v":"CM- Evaluieren"},492,{"$f":"IF(ROW(C492)-ROW(C$476)+1>COUNT(Tab_IVJ_MarketingPer[IV-J_Zeile]),\"\",INDEX(F:F,SMALL(Tab_IVJ_MarketingPer[IV-J_Zeile],1+ROW(F492)-ROW($F$476))))","v":"Soziale Medien (Website, Zeitungen, ...)"}]
[333,null,{"$f":"B_IV_Vermarktungs_Konzept!$N32","v":"CM-Zielgruppe u. Angebot erweitern"},{"$f":"B_IV_Vermarktungs_Konzept!O32","v":"-"},null,{"$f":"Tab_IVJ_MarketingPer[[#This Row],[IV-J_Funktionen]]","v":"CM-Zielgruppe u. Angebot erweitern"},493,{"$f":"IF(ROW(C493)-ROW(C$476)+1>COUNT(Tab_IVJ_MarketingPer[IV-J_Zeile]),\"\",INDEX(F:F,SMALL(Tab_IVJ_MarketingPer[IV-J_Zeile],1+ROW(F493)-ROW($F$476))))","v":"Sponsorenmappe bereits vorhanden"}]
[334,null,{"$f":"B_IV_Vermarktungs_Konzept!$P24","v":"SOLL/IST Vergleich"},{"$f":"B_IV_Vermarktungs_Konzept!Q24","v":"-"},null,{"$f":"Tab_IVJ_MarketingPer[[#This Row],[IV-J_Funktionen]]","v":"SOLL/IST Vergleich"},"",{"$f":"IF(ROW(C494)-ROW(C$476)+1>COUNT(Tab_IVJ_MarketingPer[IV-J_Zeile]),\"\",INDEX(F:F,SMALL(Tab_IVJ_MarketingPer[IV-J_Zeile],1+ROW(F494)-ROW($F$476))))","v":"Vereinspräsentation"}]
[335,null,{"$f":"B_IV_Vermarktungs_Konzept!$P25","v":"Infrastruktur"},{"$f":"B_IV_Vermarktungs_Konzept!Q25","v":"-"},null,{"$f":"Tab_IVJ_MarketingPer[[#This Row],[IV-J_Funktionen]]","v":"Infrastruktur"},495,{"$f":"IF(ROW(C495)-ROW(C$476)+1>COUNT(Tab_IVJ_MarketingPer[IV-J_Zeile]),\"\",INDEX(F:F,SMALL(Tab_IVJ_MarketingPer[IV-J_Zeile],1+ROW(F495)-ROW($F$476))))","v":"Sponsorendatenliste vorhanden"}]
[336,null,{"$f":"B_IV_Vermarktungs_Konzept!$P26","v":"Verein allgemein"},{"$f":"B_IV_Vermarktungs_Konzept!Q26","v":"-"},null,{"$f":"Tab_IVJ_MarketingPer[[#This Row],[IV-J_Funktionen]]","v":"Verein allgemein"},"",{"$f":"IF(ROW(C496)-ROW(C$476)+1>COUNT(Tab_IVJ_MarketingPer[IV-J_Zeile]),\"\",INDEX(F:F,SMALL(Tab_IVJ_MarketingPer[IV-J_Zeile],1+ROW(F496)-ROW($F$476))))","v":"Schriftliche Verträge"}]
[337,null,{"$f":"B_IV_Vermarktungs_Konzept!$P27","v":"Kleidung, Dressen, "},{"$f":"B_IV_Vermarktungs_Konzept!Q27","v":"-"},null,{"$f":"Tab_IVJ_MarketingPer[[#This Row],[IV-J_Funktionen]]","v":"Kleidung, Dressen, "},497,{"$f":"IF(ROW(C497)-ROW(C$476)+1>COUNT(Tab_IVJ_MarketingPer[IV-J_Zeile]),\"\",INDEX(F:F,SMALL(Tab_IVJ_MarketingPer[IV-J_Zeile],1+ROW(F497)-ROW($F$476))))","v":""}]
[338,null,{"$f":"B_IV_Vermarktungs_Konzept!$P28","v":"Spiel"},{"$f":"B_IV_Vermarktungs_Konzept!Q28","v":"-"},null,{"$f":"Tab_IVJ_MarketingPer[[#This Row],[IV-J_Funktionen]]","v":"Spiel"},498,{"$f":"IF(ROW(C498)-ROW(C$476)+1>COUNT(Tab_IVJ_MarketingPer[IV-J_Zeile]),\"\",INDEX(F:F,SMALL(Tab_IVJ_MarketingPer[IV-J_Zeile],1+ROW(F498)-ROW($F$476))))","v":""}]
[339,null,{"$f":"B_IV_Vermarktungs_Konzept!$P29","v":"Heimspiel"},{"$f":"B_IV_Vermarktungs_Konzept!Q29","v":"-"},null,{"$f":"Tab_IVJ_MarketingPer[[#This Row],[IV-J_Funktionen]]","v":"Heimspiel"},"",{"$f":"IF(ROW(C499)-ROW(C$476)+1>COUNT(Tab_IVJ_MarketingPer[IV-J_Zeile]),\"\",INDEX(F:F,SMALL(Tab_IVJ_MarketingPer[IV-J_Zeile],1+ROW(F499)-ROW($F$476))))","v":""}]
[340,null,{"$f":"B_IV_Vermarktungs_Konzept!$P30","v":"Werbedurchsagen"},{"$f":"B_IV_Vermarktungs_Konzept!Q30","v":"-"},null,{"$f":"Tab_IVJ_MarketingPer[[#This Row],[IV-J_Funktionen]]","v":"Werbedurchsagen"},"",{"$f":"IF(ROW(C500)-ROW(C$476)+1>COUNT(Tab_IVJ_MarketingPer[IV-J_Zeile]),\"\",INDEX(F:F,SMALL(Tab_IVJ_MarketingPer[IV-J_Zeile],1+ROW(F500)-ROW($F$476))))","v":""}]
[341,null,{"$f":"B_IV_Vermarktungs_Konzept!$P31","v":"Fernsehen, Kantine"},{"$f":"B_IV_Vermarktungs_Konzept!Q31","v":"-"},null,{"$f":"Tab_IVJ_MarketingPer[[#This Row],[IV-J_Funktionen]]","v":"Fernsehen, Kantine"},"",{"$f":"IF(ROW(C501)-ROW(C$476)+1>COUNT(Tab_IVJ_MarketingPer[IV-J_Zeile]),\"\",INDEX(F:F,SMALL(Tab_IVJ_MarketingPer[IV-J_Zeile],1+ROW(F501)-ROW($F$476))))","v":""}]
[342,null,{"$f":"B_IV_Vermarktungs_Konzept!$P32","v":"Soziale Medien (Website, Zeitungen, ...)"},{"$f":"B_IV_Vermarktungs_Konzept!Q32","v":"-"},null,{"$f":"Tab_IVJ_MarketingPer[[#This Row],[IV-J_Funktionen]]","v":"Soziale Medien (Website, Zeitungen, ...)"},502,{"$f":"IF(ROW(C502)-ROW(C$476)+1>COUNT(Tab_IVJ_MarketingPer[IV-J_Zeile]),\"\",INDEX(F:F,SMALL(Tab_IVJ_MarketingPer[IV-J_Zeile],1+ROW(F502)-ROW($F$476))))","v":""}]
[343,null,{"$f":"B_IV_Vermarktungs_Konzept!$R24","v":"Sponsorenmappe bereits vorhanden"},{"$f":"B_IV_Vermarktungs_Konzept!S24","v":"-"},null,{"$f":"Tab_IVJ_MarketingPer[[#This Row],[IV-J_Funktionen]]","v":"Sponsorenmappe bereits vorhanden"},503,{"$f":"IF(ROW(C503)-ROW(C$476)+1>COUNT(Tab_IVJ_MarketingPer[IV-J_Zeile]),\"\",INDEX(F:F,SMALL(Tab_IVJ_MarketingPer[IV-J_Zeile],1+ROW(F503)-ROW($F$476))))","v":""}]
[344,null,{"$f":"B_IV_Vermarktungs_Konzept!$R25","v":"Grundkonzept erstellt"},{"$f":"B_IV_Vermarktungs_Konzept!S25","v":"-"},null,{"$f":"Tab_IVJ_MarketingPer[[#This Row],[IV-J_Funktionen]]","v":"Grundkonzept erstellt"},"",{"$f":"IF(ROW(C504)-ROW(C$476)+1>COUNT(Tab_IVJ_MarketingPer[IV-J_Zeile]),\"\",INDEX(F:F,SMALL(Tab_IVJ_MarketingPer[IV-J_Zeile],1+ROW(F504)-ROW($F$476))))","v":""}]
[345,null,{"$f":"B_IV_Vermarktungs_Konzept!$R26","v":"Vereinspräsentation"},{"$f":"B_IV_Vermarktungs_Konzept!S26","v":"-"},null,{"$f":"Tab_IVJ_MarketingPer[[#This Row],[IV-J_Funktionen]]","v":"Vereinspräsentation"},505,{"$f":"IF(ROW(C505)-ROW(C$476)+1>COUNT(Tab_IVJ_MarketingPer[IV-J_Zeile]),\"\",INDEX(F:F,SMALL(Tab_IVJ_MarketingPer[IV-J_Zeile],1+ROW(F505)-ROW($F$476))))","v":""}]
[346,null,{"$f":"B_IV_Vermarktungs_Konzept!$R27","v":"Erwachsenenfußball Sponsorkonzept"},{"$f":"B_IV_Vermarktungs_Konzept!S27","v":"-"},null,{"$f":"Tab_IVJ_MarketingPer[[#This Row],[IV-J_Funktionen]]","v":"Erwachsenenfußball Sponsorkonzept"},"",{"$f":"IF(ROW(C506)-ROW(C$476)+1>COUNT(Tab_IVJ_MarketingPer[IV-J_Zeile]),\"\",INDEX(F:F,SMALL(Tab_IVJ_MarketingPer[IV-J_Zeile],1+ROW(F506)-ROW($F$476))))","v":""}]
[347,null,{"$f":"B_IV_Vermarktungs_Konzept!$R28","v":"Nachwuchsfußball Sponsorenkonzept"},{"$f":"B_IV_Vermarktungs_Konzept!S28","v":"-"},null,{"$f":"Tab_IVJ_MarketingPer[[#This Row],[IV-J_Funktionen]]","v":"Nachwuchsfußball Sponsorenkonzept"},"",{"$f":"IF(ROW(C507)-ROW(C$476)+1>COUNT(Tab_IVJ_MarketingPer[IV-J_Zeile]),\"\",INDEX(F:F,SMALL(Tab_IVJ_MarketingPer[IV-J_Zeile],1+ROW(F507)-ROW($F$476))))","v":""}]
[348,null,{"$f":"B_IV_Vermarktungs_Konzept!$R29","v":"Sponsorvarianten, Visionen, Ziele"},{"$f":"B_IV_Vermarktungs_Konzept!S29","v":"-"},null,{"$f":"Tab_IVJ_MarketingPer[[#This Row],[IV-J_Funktionen]]","v":"Sponsorvarianten, Visionen, Ziele"},"",{"$f":"IF(ROW(C508)-ROW(C$476)+1>COUNT(Tab_IVJ_MarketingPer[IV-J_Zeile]),\"\",INDEX(F:F,SMALL(Tab_IVJ_MarketingPer[IV-J_Zeile],1+ROW(F508)-ROW($F$476))))","v":""}]
[349,null,{"$f":"B_IV_Vermarktungs_Konzept!$R30","v":"Sponsorendatenliste vorhanden"},{"$f":"B_IV_Vermarktungs_Konzept!S30","v":"-"},null,{"$f":"Tab_IVJ_MarketingPer[[#This Row],[IV-J_Funktionen]]","v":"Sponsorendatenliste vorhanden"},509,{"$f":"IF(ROW(C509)-ROW(C$476)+1>COUNT(Tab_IVJ_MarketingPer[IV-J_Zeile]),\"\",INDEX(F:F,SMALL(Tab_IVJ_MarketingPer[IV-J_Zeile],1+ROW(F509)-ROW($F$476))))","v":""}]
[350,null,{"$f":"B_IV_Vermarktungs_Konzept!$R31","v":"Schriftliche Verträge"},{"$f":"B_IV_Vermarktungs_Konzept!S31","v":"-"},null,{"$f":"Tab_IVJ_MarketingPer[[#This Row],[IV-J_Funktionen]]","v":"Schriftliche Verträge"},510,{"$f":"IF(ROW(C510)-ROW(C$476)+1>COUNT(Tab_IVJ_MarketingPer[IV-J_Zeile]),\"\",INDEX(F:F,SMALL(Tab_IVJ_MarketingPer[IV-J_Zeile],1+ROW(F510)-ROW($F$476))))","v":""}]
[351,null,{"$f":"B_IV_Vermarktungs_Konzept!$R32","v":"Jährliche Bepreisung in Zusatzblatt"},{"$f":"B_IV_Vermarktungs_Konzept!S32","v":"-"},null,{"$f":"Tab_IVJ_MarketingPer[[#This Row],[IV-J_Funktionen]]","v":"Jährliche Bepreisung in Zusatzblatt"},"",{"$f":"IF(ROW(C511)-ROW(C$476)+1>COUNT(Tab_IVJ_MarketingPer[IV-J_Zeile]),\"\",INDEX(F:F,SMALL(Tab_IVJ_MarketingPer[IV-J_Zeile],1+ROW(F511)-ROW($F$476))))","v":""}]
[]
["L_Nr.","V. Nachhaltigkeitskonzept","V-N_Funktionen","V-N_Werte","V-N_100%","V-N_Funktion","V-N_Zeile","V-N_noch möglich"]
[352,{"$f":"B_V_Nachhaltigkeits_Konzept!$B$5","v":"N. Nachhaltigkeitsperspektive"},{"$f":"B_V_Nachhaltigkeits_Konzept!L2","v":"Strom - Test für Strategy Map"},{"$f":"B_V_Nachhaltigkeits_Konzept!M2","v":"-"},null,{"$f":"Tab_IVN_NachhaltigPer[[#This Row],[V-N_Funktionen]]","v":"Strom - Test für Strategy Map"},{"$f":"IF(COUNTIF($C$132:$C$137,F514)>=1,\"\",ROW())","v":""},{"$f":"IF(ROW(C514)-ROW(C$514)+1>COUNT(Tab_IVN_NachhaltigPer[V-N_Zeile]),\"\",INDEX(F:F,SMALL(Tab_IVN_NachhaltigPer[V-N_Zeile],1+ROW(F514)-ROW($F$514))))","v":"Vereinsgelände"}]
[353,null,{"$f":"B_V_Nachhaltigkeits_Konzept!L3","v":"Wasser"},{"$f":"B_V_Nachhaltigkeits_Konzept!M3","v":"-"},null,{"$f":"Tab_IVN_NachhaltigPer[[#This Row],[V-N_Funktionen]]","v":"Wasser"},{"$f":"IF(COUNTIF($C$132:$C$137,F515)>=1,\"\",ROW())","v":""},{"$f":"IF(ROW(C515)-ROW(C$514)+1>COUNT(Tab_IVN_NachhaltigPer[V-N_Zeile]),\"\",INDEX(F:F,SMALL(Tab_IVN_NachhaltigPer[V-N_Zeile],1+ROW(F515)-ROW($F$514))))","v":"Verwaltung"}]
[354,null,{"$f":"B_V_Nachhaltigkeits_Konzept!L4","v":"Gastronomie"},{"$f":"B_V_Nachhaltigkeits_Konzept!M4","v":"-"},null,{"$f":"Tab_IVN_NachhaltigPer[[#This Row],[V-N_Funktionen]]","v":"Gastronomie"},"",{"$f":"IF(ROW(C516)-ROW(C$514)+1>COUNT(Tab_IVN_NachhaltigPer[V-N_Zeile]),\"\",INDEX(F:F,SMALL(Tab_IVN_NachhaltigPer[V-N_Zeile],1+ROW(F516)-ROW($F$514))))","v":"Test"}]
[355,null,{"$f":"B_V_Nachhaltigkeits_Konzept!L5","v":"Rasen"},{"$f":"B_V_Nachhaltigkeits_Konzept!M5","v":"-"},null,{"$f":"Tab_IVN_NachhaltigPer[[#This Row],[V-N_Funktionen]]","v":"Rasen"},"",{"$f":"IF(ROW(C517)-ROW(C$514)+1>COUNT(Tab_IVN_NachhaltigPer[V-N_Zeile]),\"\",INDEX(F:F,SMALL(Tab_IVN_NachhaltigPer[V-N_Zeile],1+ROW(F517)-ROW($F$514))))","v":""}]
[356,null,{"$f":"B_V_Nachhaltigkeits_Konzept!L6","v":"Vereinsgelände"},{"$f":"B_V_Nachhaltigkeits_Konzept!M6","v":"-"},null,{"$f":"Tab_IVN_NachhaltigPer[[#This Row],[V-N_Funktionen]]","v":"Vereinsgelände"},518,{"$f":"IF(ROW(C518)-ROW(C$514)+1>COUNT(Tab_IVN_NachhaltigPer[V-N_Zeile]),\"\",INDEX(F:F,SMALL(Tab_IVN_NachhaltigPer[V-N_Zeile],1+ROW(F518)-ROW($F$514))))","v":""}]
[357,null,{"$f":"B_V_Nachhaltigkeits_Konzept!L7","v":"Veranstaltungen"},{"$f":"B_V_Nachhaltigkeits_Konzept!M7","v":"-"},null,{"$f":"Tab_IVN_NachhaltigPer[[#This Row],[V-N_Funktionen]]","v":"Veranstaltungen"},"",{"$f":"IF(ROW(C519)-ROW(C$514)+1>COUNT(Tab_IVN_NachhaltigPer[V-N_Zeile]),\"\",INDEX(F:F,SMALL(Tab_IVN_NachhaltigPer[V-N_Zeile],1+ROW(F519)-ROW($F$514))))","v":""}]
[358,null,{"$f":"B_V_Nachhaltigkeits_Konzept!L8","v":"Gebäude"},{"$f":"B_V_Nachhaltigkeits_Konzept!M8","v":"-"},null,{"$f":"Tab_IVN_NachhaltigPer[[#This Row],[V-N_Funktionen]]","v":"Gebäude"},"",{"$f":"IF(ROW(C520)-ROW(C$514)+1>COUNT(Tab_IVN_NachhaltigPer[V-N_Zeile]),\"\",INDEX(F:F,SMALL(Tab_IVN_NachhaltigPer[V-N_Zeile],1+ROW(F520)-ROW($F$514))))","v":""}]
[359,null,{"$f":"B_V_Nachhaltigkeits_Konzept!L9","v":"Verwaltung"},{"$f":"B_V_Nachhaltigkeits_Konzept!M9","v":"-"},null,{"$f":"Tab_IVN_NachhaltigPer[[#This Row],[V-N_Funktionen]]","v":"Verwaltung"},521,{"$f":"IF(ROW(C521)-ROW(C$514)+1>COUNT(Tab_IVN_NachhaltigPer[V-N_Zeile]),\"\",INDEX(F:F,SMALL(Tab_IVN_NachhaltigPer[V-N_Zeile],1+ROW(F521)-ROW($F$514))))","v":""}]
[360,null,{"$f":"B_V_Nachhaltigkeits_Konzept!L10","v":"Test"},{"$f":"B_V_Nachhaltigkeits_Konzept!M10","v":"-"},null,{"$f":"Tab_IVN_NachhaltigPer[[#This Row],[V-N_Funktionen]]","v":"Test"},522,{"$f":"IF(ROW(C522)-ROW(C$514)+1>COUNT(Tab_IVN_NachhaltigPer[V-N_Zeile]),\"\",INDEX(F:F,SMALL(Tab_IVN_NachhaltigPer[V-N_Zeile],1+ROW(F522)-ROW($F$514))))","v":""}]

{"sheet":"VereinsBest-Diagramme","index":4,"n_rows":560,"n_cols":40,"rows_kept":560,"cut":false,"hidden":true,"merged":[[1,39,1,55],[3,0,50,0],[154,0,159,0],[0,0,0,38],[1,0,1,38],[2,0,2,38],[51,0,51,38],[52,0,75,0],[76,0,76,3],[77,0,106,0],[107,0,107,3],[108,0,152,0],[153,0,153,3]]}
["Benchmark \"VereinsBest\""]
["Säulendiagramm",null,null,null,null,null,null,null,null,null,null,null,null,null,null,null,null,null,null,null,null,null,null,null,null,null,null,null,null,null,null,null,null,null,null,null,null,null,null,"Netzdiagramm"]
[{"$f":"B_Konzept!B5","v":"I. Entwicklungskonzept"}]
[{"$f":"A3","v":"I. Entwicklungskonzept"}]
[]
[]
[]
[]
[]
[]
[]
[]
[]
[]
[]
[]
[]
[]
[]
[]
[]
[]
[]
[]
[]
[]
[]
[]
[]
[]
[]
[]
[]
[]
[]
[]
[]
[]
[]
[]
[]
[]
[]
[]
[]
[]
[]
[]
[]
[]
[]
[{"$f":"B_Konzept!B6","v":"II. Verwaltungskonzept"}]
[{"$f":"$A$52","v":"II. Verwaltungskonzept"}]
[]
[]
[]
[]
[]
[]
[]
[]
[]
[]
[]
[]
[]
[]
[]
[]
[]
[]
[]
[]
[]
[]
[]
[{"$f":"B_Konzept!B7","v":"III. Sportkonzept"}]
[{"$f":"A77","v":"III. Sportkonzept"}]
[]
[]
[]
[]
[]
[]
[]
[]
[]
[]
[]
[]
[]
[]
[]
[]
[]
[]
[]
[]
[]
[]
[]
[]
[]
[]
[]
[]
[]
[{"$f":"B_Konzept!B8","v":"IV. Vermarktungskonzept"}]
[{"$f":"A108","v":"IV. Vermarktungskonzept"}]
[]
[]
[]
[]
[]
[]
[]
[]
[]
[]
[]
[]
[]
[]
[]
[]
[]
[]
[]
[]
[]
[]
[]
[]
[]
[]
[]
[]
[]
[]
[]
[]
[]
[]
[]
[]
[]
[]
[]
[]
[]
[]
[]
[]
[{"$f":"B_Konzept!B9","v":"V. Nachhaltigkeitskonzept"}]
[{"$f":"A154","v":"V. Nachhaltigkeitskonzept"}]
[]
[]
[]
[]
[]
[]
[]
[]
[]
[]
[]
[]
[]
[]
[]
[]
[]
[]
[]
[]
[null,"\"=BEREICH.VERSCHIEBEN(Tabelle1!$R$6;0;0;ANZAHL(Tabelle1!$Q$6:$Q$14);1)"]
[]
[null,"\"=WENN(ZEILE(C150)-ZEILE(C$150)+1>ANZAHL($Q$150:$Q$185);\"\";INDEX(P:P;KKLEINSTE($Q$150:$Q$185;1+ZEILE(P150)-ZEILE($P$150))))"]
[]
["L_Nr.","I. Entwicklungskonzept","I-A_Funktionen","I-A_Werte","I-A_100%","I-A_Funktion","I-A_Zeile","I-A_noch möglich"]
[1,{"$f":"B_I_A_VereinsPersp!$B$4","v":"A. Vereinsperspektive"},{"$f":"B_I_Entw_Konzept!L2","v":"Leitideen"},{"$f":"B_I_Entw_Konzept!M2","v":"-"},null,{"$f":"Tab_IA_VereinsPers13[[#This Row],[I-A_Funktionen]]","v":"Leitideen"},{"$f":"IF(COUNTIF($C$4:$C$15,#REF!)>=1,\"\",ROW())","v":181},{"$f":"IF(ROW(C181)-ROW(C$181)+1>COUNT(Tab_IA_VereinsPers13[I-A_Zeile]),\"\",INDEX(F:F,SMALL(Tab_IA_VereinsPers13[I-A_Zeile],1+ROW(F181)-ROW($F$181))))","v":"Leitideen"}]
[2,null,{"$f":"B_I_Entw_Konzept!L3","v":"Sinn und Zweck"},{"$f":"B_I_Entw_Konzept!M3","v":"-"},null,{"$f":"Tab_IA_VereinsPers13[[#This Row],[I-A_Funktionen]]","v":"Sinn und Zweck"},{"$f":"IF(COUNTIF($C$4:$C$15,F182)>=1,\"\",ROW())","v":182},{"$f":"IF(ROW(C182)-ROW(C$181)+1>COUNT(Tab_IA_VereinsPers13[I-A_Zeile]),\"\",INDEX(F:F,SMALL(Tab_IA_VereinsPers13[I-A_Zeile],1+ROW(F182)-ROW($F$181))))","v":"Sinn und Zweck"}]
[3,null,{"$f":"B_I_Entw_Konzept!L4","v":"Nutzen für Mitglieder und Gesellschaft"},{"$f":"B_I_Entw_Konzept!M4","v":"-"},null,{"$f":"Tab_IA_VereinsPers13[[#This Row],[I-A_Funktionen]]","v":"Nutzen für Mitglieder und Gesellschaft"},{"$f":"IF(COUNTIF($C$4:$C$15,F183)>=1,\"\",ROW())","v":183},{"$f":"IF(ROW(C183)-ROW(C$181)+1>COUNT(Tab_IA_VereinsPers13[I-A_Zeile]),\"\",INDEX(F:F,SMALL(Tab_IA_VereinsPers13[I-A_Zeile],1+ROW(F183)-ROW($F$181))))","v":"Nutzen für Mitglieder und Gesellschaft"}]
[4,null,{"$f":"B_I_Entw_Konzept!L5","v":"Normen"},{"$f":"B_I_Entw_Konzept!M5","v":"-"},null,{"$f":"Tab_IA_VereinsPers13[[#This Row],[I-A_Funktionen]]","v":"Normen"},184,{"$f":"IF(ROW(C184)-ROW(C$181)+1>COUNT(Tab_IA_VereinsPers13[I-A_Zeile]),\"\",INDEX(F:F,SMALL(Tab_IA_VereinsPers13[I-A_Zeile],1+ROW(F184)-ROW($F$181))))","v":"Normen"}]
[5,null,{"$f":"B_I_Entw_Konzept!L6","v":"Werte"},{"$f":"B_I_Entw_Konzept!M6","v":"-"},null,{"$f":"Tab_IA_VereinsPers13[[#This Row],[I-A_Funktionen]]","v":"Werte"},185,{"$f":"IF(ROW(C185)-ROW(C$181)+1>COUNT(Tab_IA_VereinsPers13[I-A_Zeile]),\"\",INDEX(F:F,SMALL(Tab_IA_VereinsPers13[I-A_Zeile],1+ROW(F185)-ROW($F$181))))","v":"Werte"}]
[6,null,{"$f":"B_I_Entw_Konzept!L7","v":"Muster"},{"$f":"B_I_Entw_Konzept!M7","v":"-"},null,{"$f":"Tab_IA_VereinsPers13[[#This Row],[I-A_Funktionen]]","v":"Muster"},186,{"$f":"IF(ROW(C186)-ROW(C$181)+1>COUNT(Tab_IA_VereinsPers13[I-A_Zeile]),\"\",INDEX(F:F,SMALL(Tab_IA_VereinsPers13[I-A_Zeile],1+ROW(F186)-ROW($F$181))))","v":"Muster"}]
[7,null,{"$f":"B_I_Entw_Konzept!L8","v":"Mission"},{"$f":"B_I_Entw_Konzept!M8","v":"-"},null,{"$f":"Tab_IA_VereinsPers13[[#This Row],[I-A_Funktionen]]","v":"Mission"},187,{"$f":"IF(ROW(C187)-ROW(C$181)+1>COUNT(Tab_IA_VereinsPers13[I-A_Zeile]),\"\",INDEX(F:F,SMALL(Tab_IA_VereinsPers13[I-A_Zeile],1+ROW(F187)-ROW($F$181))))","v":"Mission"}]
[8,null,{"$f":"B_I_Entw_Konzept!L9","v":"Visionen"},{"$f":"B_I_Entw_Konzept!M9","v":"-"},null,{"$f":"Tab_IA_VereinsPers13[[#This Row],[I-A_Funktionen]]","v":"Visionen"},188,{"$f":"IF(ROW(C188)-ROW(C$181)+1>COUNT(Tab_IA_VereinsPers13[I-A_Zeile]),\"\",INDEX(F:F,SMALL(Tab_IA_VereinsPers13[I-A_Zeile],1+ROW(F188)-ROW($F$181))))","v":"Visionen"}]
[9,null,{"$f":"B_I_Entw_Konzept!L10","v":"Leitsätze"},{"$f":"B_I_Entw_Konzept!M10","v":"-"},null,{"$f":"Tab_IA_VereinsPers13[[#This Row],[I-A_Funktionen]]","v":"Leitsätze"},189,{"$f":"IF(ROW(C189)-ROW(C$181)+1>COUNT(Tab_IA_VereinsPers13[I-A_Zeile]),\"\",INDEX(F:F,SMALL(Tab_IA_VereinsPers13[I-A_Zeile],1+ROW(F189)-ROW($F$181))))","v":"Leitsätze"}]
[10,null,{"$f":"B_I_Entw_Konzept!N2","v":"Sportliche Ziele"},{"$f":"B_I_Entw_Konzept!O2","v":"-"},null,{"$f":"Tab_IA_VereinsPers13[[#This Row],[I-A_Funktionen]]","v":"Sportliche Ziele"},190,{"$f":"IF(ROW(C190)-ROW(C$181)+1>COUNT(Tab_IA_VereinsPers13[I-A_Zeile]),\"\",INDEX(F:F,SMALL(Tab_IA_VereinsPers13[I-A_Zeile],1+ROW(F190)-ROW($F$181))))","v":"Sportliche Ziele"}]
[11,null,{"$f":"B_I_Entw_Konzept!N3","v":"Wirtschaftliche Ziele"},{"$f":"B_I_Entw_Konzept!O3","v":"-"},null,{"$f":"Tab_IA_VereinsPers13[[#This Row],[I-A_Funktionen]]","v":"Wirtschaftliche Ziele"},191,{"$f":"IF(ROW(C191)-ROW(C$181)+1>COUNT(Tab_IA_VereinsPers13[I-A_Zeile]),\"\",INDEX(F:F,SMALL(Tab_IA_VereinsPers13[I-A_Zeile],1+ROW(F191)-ROW($F$181))))","v":"Wirtschaftliche Ziele"}]
[12,null,{"$f":"B_I_Entw_Konzept!N4","v":"Gesellschaftliche Ziele"},{"$f":"B_I_Entw_Konzept!O4","v":"-"},null,{"$f":"Tab_IA_VereinsPers13[[#This Row],[I-A_Funktionen]]","v":"Gesellschaftliche Ziele"},192,{"$f":"IF(ROW(C192)-ROW(C$181)+1>COUNT(Tab_IA_VereinsPers13[I-A_Zeile]),\"\",INDEX(F:F,SMALL(Tab_IA_VereinsPers13[I-A_Zeile],1+ROW(F192)-ROW($F$181))))","v":"Gesellschaftliche Ziele"}]
[13,null,{"$f":"B_I_Entw_Konzept!N5","v":"A2_Ziele 4"},{"$f":"B_I_Entw_Konzept!O5","v":"-"},null,{"$f":"Tab_IA_VereinsPers13[[#This Row],[I-A_Funktionen]]","v":"A2_Ziele 4"},193,{"$f":"IF(ROW(C193)-ROW(C$181)+1>COUNT(Tab_IA_VereinsPers13[I-A_Zeile]),\"\",INDEX(F:F,SMALL(Tab_IA_VereinsPers13[I-A_Zeile],1+ROW(F193)-ROW($F$181))))","v":"A2_Ziele 4"}]
[14,null,{"$f":"B_I_Entw_Konzept!N6","v":"A2_Ziele 5"},{"$f":"B_I_Entw_Konzept!O6","v":"-"},null,{"$f":"Tab_IA_VereinsPers13[[#This Row],[I-A_Funktionen]]","v":"A2_Ziele 5"},194,{"$f":"IF(ROW(C194)-ROW(C$181)+1>COUNT(Tab_IA_VereinsPers13[I-A_Zeile]),\"\",INDEX(F:F,SMALL(Tab_IA_VereinsPers13[I-A_Zeile],1+ROW(F194)-ROW($F$181))))","v":"A2_Ziele 5"}]
[15,null,{"$f":"B_I_Entw_Konzept!N7","v":"A2_Ziele 6"},{"$f":"B_I_Entw_Konzept!O7","v":"-"},null,{"$f":"Tab_IA_VereinsPers13[[#This Row],[I-A_Funktionen]]","v":"A2_Ziele 6"},195,{"$f":"IF(ROW(C195)-ROW(C$181)+1>COUNT(Tab_IA_VereinsPers13[I-A_Zeile]),\"\",INDEX(F:F,SMALL(Tab_IA_VereinsPers13[I-A_Zeile],1+ROW(F195)-ROW($F$181))))","v":"A2_Ziele 6"}]
[16,null,{"$f":"B_I_Entw_Konzept!N8","v":"A2_Ziele 7"},{"$f":"B_I_Entw_Konzept!O8","v":"-"},null,{"$f":"Tab_IA_VereinsPers13[[#This Row],[I-A_Funktionen]]","v":"A2_Ziele 7"},196,{"$f":"IF(ROW(C196)-ROW(C$181)+1>COUNT(Tab_IA_VereinsPers13[I-A_Zeile]),\"\",INDEX(F:F,SMALL(Tab_IA_VereinsPers13[I-A_Zeile],1+ROW(F196)-ROW($F$181))))","v":"A2_Ziele 7"}]
[17,null,{"$f":"B_I_Entw_Konzept!N9","v":"A2_Ziele 8"},{"$f":"B_I_Entw_Konzept!O9","v":"-"},null,{"$f":"Tab_IA_VereinsPers13[[#This Row],[I-A_Funktionen]]","v":"A2_Ziele 8"},197,{"$f":"IF(ROW(C197)-ROW(C$181)+1>COUNT(Tab_IA_VereinsPers13[I-A_Zeile]),\"\",INDEX(F:F,SMALL(Tab_IA_VereinsPers13[I-A_Zeile],1+ROW(F197)-ROW($F$181))))","v":"A2_Ziele 8"}]
[18,null,{"$f":"B_I_Entw_Konzept!N10","v":"A2_Ziele 9"},{"$f":"B_I_Entw_Konzept!O10","v":"-"},null,{"$f":"Tab_IA_VereinsPers13[[#This Row],[I-A_Funktionen]]","v":"A2_Ziele 9"},198,{"$f":"IF(ROW(C198)-ROW(C$181)+1>COUNT(Tab_IA_VereinsPers13[I-A_Zeile]),\"\",INDEX(F:F,SMALL(Tab_IA_VereinsPers13[I-A_Zeile],1+ROW(F198)-ROW($F$181))))","v":"A2_Ziele 9"}]
[19,null,{"$f":"B_I_Entw_Konzept!P2","v":"BEnt1 - Vereinsstrategie"},{"$f":"B_I_Entw_Konzept!Q2","v":0.99},null,{"$f":"Tab_IA_VereinsPers13[[#This Row],[I-A_Funktionen]]","v":"BEnt1 - Vereinsstrategie"},199,{"$f":"IF(ROW(C199)-ROW(C$181)+1>COUNT(Tab_IA_VereinsPers13[I-A_Zeile]),\"\",INDEX(F:F,SMALL(Tab_IA_VereinsPers13[I-A_Zeile],1+ROW(F199)-ROW($F$181))))","v":"BEnt1 - Vereinsstrategie"}]
[20,null,{"$f":"B_I_Entw_Konzept!P3","v":"Wirtschaftliche Strategien"},{"$f":"B_I_Entw_Konzept!Q3","v":"-"},null,{"$f":"Tab_IA_VereinsPers13[[#This Row],[I-A_Funktionen]]","v":"Wirtschaftliche Strategien"},200,{"$f":"IF(ROW(C200)-ROW(C$181)+1>COUNT(Tab_IA_VereinsPers13[I-A_Zeile]),\"\",INDEX(F:F,SMALL(Tab_IA_VereinsPers13[I-A_Zeile],1+ROW(F200)-ROW($F$181))))","v":"Wirtschaftliche Strategien"}]
[21,null,{"$f":"B_I_Entw_Konzept!P4","v":"Gesellschaftliche Strategien"},{"$f":"B_I_Entw_Konzept!Q4","v":"-"},null,{"$f":"Tab_IA_VereinsPers13[[#This Row],[I-A_Funktionen]]","v":"Gesellschaftliche Strategien"},201,{"$f":"IF(ROW(C201)-ROW(C$181)+1>COUNT(Tab_IA_VereinsPers13[I-A_Zeile]),\"\",INDEX(F:F,SMALL(Tab_IA_VereinsPers13[I-A_Zeile],1+ROW(F201)-ROW($F$181))))","v":"Gesellschaftliche Strategien"}]
[22,null,{"$f":"B_I_Entw_Konzept!P5","v":"Sportliche Strategien"},{"$f":"B_I_Entw_Konzept!Q5","v":"-"},null,{"$f":"Tab_IA_VereinsPers13[[#This Row],[I-A_Funktionen]]","v":"Sportliche Strategien"},202,{"$f":"IF(ROW(C202)-ROW(C$181)+1>COUNT(Tab_IA_VereinsPers13[I-A_Zeile]),\"\",INDEX(F:F,SMALL(Tab_IA_VereinsPers13[I-A_Zeile],1+ROW(F202)-ROW($F$181))))","v":"Sportliche Strategien"}]
[23,null,{"$f":"B_I_Entw_Konzept!P6","v":"Nachwuchs Strategien"},{"$f":"B_I_Entw_Konzept!Q6","v":"-"},null,{"$f":"Tab_IA_VereinsPers13[[#This Row],[I-A_Funktionen]]","v":"Nachwuchs Strategien"},203,{"$f":"IF(ROW(C203)-ROW(C$181)+1>COUNT(Tab_IA_VereinsPers13[I-A_Zeile]),\"\",INDEX(F:F,SMALL(Tab_IA_VereinsPers13[I-A_Zeile],1+ROW(F203)-ROW($F$181))))","v":"Nachwuchs Strategien"}]
[24,null,{"$f":"B_I_Entw_Konzept!P7","v":"Veranstaltung"},{"$f":"B_I_Entw_Konzept!Q7","v":"-"},null,{"$f":"Tab_IA_VereinsPers13[[#This Row],[I-A_Funktionen]]","v":"Veranstaltung"},204,{"$f":"IF(ROW(C204)-ROW(C$181)+1>COUNT(Tab_IA_VereinsPers13[I-A_Zeile]),\"\",INDEX(F:F,SMALL(Tab_IA_VereinsPers13[I-A_Zeile],1+ROW(F204)-ROW($F$181))))","v":"Veranstaltung"}]
[25,null,{"$f":"B_I_Entw_Konzept!P8","v":"A3_Strategie 7"},{"$f":"B_I_Entw_Konzept!Q8","v":"-"},null,{"$f":"Tab_IA_VereinsPers13[[#This Row],[I-A_Funktionen]]","v":"A3_Strategie 7"},205,{"$f":"IF(ROW(C205)-ROW(C$181)+1>COUNT(Tab_IA_VereinsPers13[I-A_Zeile]),\"\",INDEX(F:F,SMALL(Tab_IA_VereinsPers13[I-A_Zeile],1+ROW(F205)-ROW($F$181))))","v":"A3_Strategie 7"}]
[26,null,{"$f":"B_I_Entw_Konzept!P9","v":"A3_Strategie 8"},{"$f":"B_I_Entw_Konzept!Q9","v":"-"},null,{"$f":"Tab_IA_VereinsPers13[[#This Row],[I-A_Funktionen]]","v":"A3_Strategie 8"},206,{"$f":"IF(ROW(C206)-ROW(C$181)+1>COUNT(Tab_IA_VereinsPers13[I-A_Zeile]),\"\",INDEX(F:F,SMALL(Tab_IA_VereinsPers13[I-A_Zeile],1+ROW(F206)-ROW($F$181))))","v":"A3_Strategie 8"}]
[27,null,{"$f":"B_I_Entw_Konzept!P10","v":"A3_Strategie 9"},{"$f":"B_I_Entw_Konzept!Q10","v":"-"},null,{"$f":"Tab_IA_VereinsPers13[[#This Row],[I-A_Funktionen]]","v":"A3_Strategie 9"},207,{"$f":"IF(ROW(C207)-ROW(C$181)+1>COUNT(Tab_IA_VereinsPers13[I-A_Zeile]),\"\",INDEX(F:F,SMALL(Tab_IA_VereinsPers13[I-A_Zeile],1+ROW(F207)-ROW($F$181))))","v":"A3_Strategie 9"}]
[28,null,{"$f":"B_I_Entw_Konzept!R2","v":"Sportliche Aktonsplan"},{"$f":"B_I_Entw_Konzept!S2","v":"-"},null,{"$f":"Tab_IA_VereinsPers13[[#This Row],[I-A_Funktionen]]","v":"Sportliche Aktonsplan"},208,{"$f":"IF(ROW(C208)-ROW(C$181)+1>COUNT(Tab_IA_VereinsPers13[I-A_Zeile]),\"\",INDEX(F:F,SMALL(Tab_IA_VereinsPers13[I-A_Zeile],1+ROW(F208)-ROW($F$181))))","v":"Sportliche Aktonsplan"}]
[29,null,{"$f":"B_I_Entw_Konzept!R3","v":"Wirtschaftliche Aktionsplan"},{"$f":"B_I_Entw_Konzept!S3","v":"-"},null,{"$f":"Tab_IA_VereinsPers13[[#This Row],[I-A_Funktionen]]","v":"Wirtschaftliche Aktionsplan"},209,{"$f":"IF(ROW(C209)-ROW(C$181)+1>COUNT(Tab_IA_VereinsPers13[I-A_Zeile]),\"\",INDEX(F:F,SMALL(Tab_IA_VereinsPers13[I-A_Zeile],1+ROW(F209)-ROW($F$181))))","v":"Wirtschaftliche Aktionsplan"}]
[30,null,{"$f":"B_I_Entw_Konzept!R4","v":"Gesellschaftliche Aktionsplan"},{"$f":"B_I_Entw_Konzept!S4","v":"-"},null,{"$f":"Tab_IA_VereinsPers13[[#This Row],[I-A_Funktionen]]","v":"Gesellschaftliche Aktionsplan"},210,{"$f":"IF(ROW(C210)-ROW(C$181)+1>COUNT(Tab_IA_VereinsPers13[I-A_Zeile]),\"\",INDEX(F:F,SMALL(Tab_IA_VereinsPers13[I-A_Zeile],1+ROW(F210)-ROW($F$181))))","v":"Gesellschaftliche Aktionsplan"}]
[31,null,{"$f":"B_I_Entw_Konzept!R5","v":"A4_Aktionsplan 4"},{"$f":"B_I_Entw_Konzept!S5","v":"-"},null,{"$f":"Tab_IA_VereinsPers13[[#This Row],[I-A_Funktionen]]","v":"A4_Aktionsplan 4"},211,{"$f":"IF(ROW(C211)-ROW(C$181)+1>COUNT(Tab_IA_VereinsPers13[I-A_Zeile]),\"\",INDEX(F:F,SMALL(Tab_IA_VereinsPers13[I-A_Zeile],1+ROW(F211)-ROW($F$181))))","v":"A4_Aktionsplan 4"}]
[32,null,{"$f":"B_I_Entw_Konzept!R6","v":"A4_Aktionsplan 5"},{"$f":"B_I_Entw_Konzept!S6","v":"-"},null,{"$f":"Tab_IA_VereinsPers13[[#This Row],[I-A_Funktionen]]","v":"A4_Aktionsplan 5"},212,{"$f":"IF(ROW(C212)-ROW(C$181)+1>COUNT(Tab_IA_VereinsPers13[I-A_Zeile]),\"\",INDEX(F:F,SMALL(Tab_IA_VereinsPers13[I-A_Zeile],1+ROW(F212)-ROW($F$181))))","v":"A4_Aktionsplan 5"}]
[33,null,{"$f":"B_I_Entw_Konzept!R7","v":"A4_Aktionsplan 6"},{"$f":"B_I_Entw_Konzept!S7","v":"-"},null,{"$f":"Tab_IA_VereinsPers13[[#This Row],[I-A_Funktionen]]","v":"A4_Aktionsplan 6"},213,{"$f":"IF(ROW(C213)-ROW(C$181)+1>COUNT(Tab_IA_VereinsPers13[I-A_Zeile]),\"\",INDEX(F:F,SMALL(Tab_IA_VereinsPers13[I-A_Zeile],1+ROW(F213)-ROW($F$181))))","v":"A4_Aktionsplan 6"}]
[34,null,{"$f":"B_I_Entw_Konzept!R8","v":"A4_Aktionsplan 7"},{"$f":"B_I_Entw_Konzept!S8","v":"-"},null,{"$f":"Tab_IA_VereinsPers13[[#This Row],[I-A_Funktionen]]","v":"A4_Aktionsplan 7"},214,{"$f":"IF(ROW(C214)-ROW(C$181)+1>COUNT(Tab_IA_VereinsPers13[I-A_Zeile]),\"\",INDEX(F:F,SMALL(Tab_IA_VereinsPers13[I-A_Zeile],1+ROW(F214)-ROW($F$181))))","v":"A4_Aktionsplan 7"}]
[35,null,{"$f":"B_I_Entw_Konzept!R9","v":"A4_Aktionsplan 8"},{"$f":"B_I_Entw_Konzept!S9","v":"-"},null,{"$f":"Tab_IA_VereinsPers13[[#This Row],[I-A_Funktionen]]","v":"A4_Aktionsplan 8"},215,{"$f":"IF(ROW(C215)-ROW(C$181)+1>COUNT(Tab_IA_VereinsPers13[I-A_Zeile]),\"\",INDEX(F:F,SMALL(Tab_IA_VereinsPers13[I-A_Zeile],1+ROW(F215)-ROW($F$181))))","v":"A4_Aktionsplan 8"}]
[36,null,{"$f":"B_I_Entw_Konzept!R10","v":"A4_Aktionsplan 9"},{"$f":"B_I_Entw_Konzept!S10","v":"-"},null,{"$f":"Tab_IA_VereinsPers13[[#This Row],[I-A_Funktionen]]","v":"A4_Aktionsplan 9"},216,{"$f":"IF(ROW(C216)-ROW(C$181)+1>COUNT(Tab_IA_VereinsPers13[I-A_Zeile]),\"\",INDEX(F:F,SMALL(Tab_IA_VereinsPers13[I-A_Zeile],1+ROW(F216)-ROW($F$181))))","v":"A4_Aktionsplan 9"}]
[]
["L_Nr.","I. Entwicklungskonzept","I-B_Funktionen","I-B_Werte","I-B_100%","I-B_Funktion","I-B_Zeile","I-B_noch möglich"]
[37,{"$f":"B_I_Entw_Konzept!$B$6","v":"B. (Aus)Bildungsperspektive"},{"$f":"B_I_Entw_Konzept!L13","v":"Kompetenzen Know How Fkt."},{"$f":"B_I_Entw_Konzept!M13","v":"-"},null,{"$f":"Tab_IB_AusBildPer14[[#This Row],[I-B_Funktionen]]","v":"Kompetenzen Know How Fkt."},{"$f":"IF(COUNTIF($C$16:$C$51,F219)>=1,\"\",ROW())","v":219},{"$f":"IF(ROW(C219)-ROW(C$219)+1>COUNT(Tab_IB_AusBildPer14[I-B_Zeile]),\"\",INDEX(F:F,SMALL(Tab_IB_AusBildPer14[I-B_Zeile],1+ROW(F219)-ROW($F$219))))","v":"Kompetenzen Know How Fkt."}]
[38,null,{"$f":"B_I_Entw_Konzept!L14","v":"Fachwissen Know How Fkt."},{"$f":"B_I_Entw_Konzept!M14","v":"-"},null,{"$f":"Tab_IB_AusBildPer14[[#This Row],[I-B_Funktionen]]","v":"Fachwissen Know How Fkt."},{"$f":"IF(COUNTIF($C$16:$C$51,F220)>=1,\"\",ROW())","v":220},{"$f":"IF(ROW(C220)-ROW(C$219)+1>COUNT(Tab_IB_AusBildPer14[I-B_Zeile]),\"\",INDEX(F:F,SMALL(Tab_IB_AusBildPer14[I-B_Zeile],1+ROW(F220)-ROW($F$219))))","v":"Fachwissen Know How Fkt."}]
[39,null,{"$f":"B_I_Entw_Konzept!L15","v":"Berufliche Fähigkeiten Fkt."},{"$f":"B_I_Entw_Konzept!M15","v":"-"},null,{"$f":"Tab_IB_AusBildPer14[[#This Row],[I-B_Funktionen]]","v":"Berufliche Fähigkeiten Fkt."},221,{"$f":"IF(ROW(C221)-ROW(C$219)+1>COUNT(Tab_IB_AusBildPer14[I-B_Zeile]),\"\",INDEX(F:F,SMALL(Tab_IB_AusBildPer14[I-B_Zeile],1+ROW(F221)-ROW($F$219))))","v":"Berufliche Fähigkeiten Fkt."}]
[40,null,{"$f":"B_I_Entw_Konzept!L16","v":"Soziale Kompetenz Fkt."},{"$f":"B_I_Entw_Konzept!M16","v":"-"},null,{"$f":"Tab_IB_AusBildPer14[[#This Row],[I-B_Funktionen]]","v":"Soziale Kompetenz Fkt."},222,{"$f":"IF(ROW(C222)-ROW(C$219)+1>COUNT(Tab_IB_AusBildPer14[I-B_Zeile]),\"\",INDEX(F:F,SMALL(Tab_IB_AusBildPer14[I-B_Zeile],1+ROW(F222)-ROW($F$219))))","v":"Soziale Kompetenz Fkt."}]
[41,null,{"$f":"B_I_Entw_Konzept!L17","v":"Weiterbildung Fkt."},{"$f":"B_I_Entw_Konzept!M17","v":"-"},null,{"$f":"Tab_IB_AusBildPer14[[#This Row],[I-B_Funktionen]]","v":"Weiterbildung Fkt."},223,{"$f":"IF(ROW(C223)-ROW(C$219)+1>COUNT(Tab_IB_AusBildPer14[I-B_Zeile]),\"\",INDEX(F:F,SMALL(Tab_IB_AusBildPer14[I-B_Zeile],1+ROW(F223)-ROW($F$219))))","v":"Weiterbildung Fkt."}]
[42,null,{"$f":"B_I_Entw_Konzept!L18","v":"Standing in der Region Fkt."},{"$f":"B_I_Entw_Konzept!M18","v":"-"},null,{"$f":"Tab_IB_AusBildPer14[[#This Row],[I-B_Funktionen]]","v":"Standing in der Region Fkt."},224,{"$f":"IF(ROW(C224)-ROW(C$219)+1>COUNT(Tab_IB_AusBildPer14[I-B_Zeile]),\"\",INDEX(F:F,SMALL(Tab_IB_AusBildPer14[I-B_Zeile],1+ROW(F224)-ROW($F$219))))","v":"Standing in der Region Fkt."}]
[43,null,{"$f":"B_I_Entw_Konzept!L19","v":"Zeitliche Ressourcen Fkt."},{"$f":"B_I_Entw_Konzept!M19","v":"-"},null,{"$f":"Tab_IB_AusBildPer14[[#This Row],[I-B_Funktionen]]","v":"Zeitliche Ressourcen Fkt."},225,{"$f":"IF(ROW(C225)-ROW(C$219)+1>COUNT(Tab_IB_AusBildPer14[I-B_Zeile]),\"\",INDEX(F:F,SMALL(Tab_IB_AusBildPer14[I-B_Zeile],1+ROW(F225)-ROW($F$219))))","v":"Zeitliche Ressourcen Fkt."}]
[44,null,{"$f":"B_I_Entw_Konzept!L20","v":"Identifikation Fkt."},{"$f":"B_I_Entw_Konzept!M20","v":"-"},null,{"$f":"Tab_IB_AusBildPer14[[#This Row],[I-B_Funktionen]]","v":"Identifikation Fkt."},226,{"$f":"IF(ROW(C226)-ROW(C$219)+1>COUNT(Tab_IB_AusBildPer14[I-B_Zeile]),\"\",INDEX(F:F,SMALL(Tab_IB_AusBildPer14[I-B_Zeile],1+ROW(F226)-ROW($F$219))))","v":"Identifikation Fkt."}]
[45,null,{"$f":"B_I_Entw_Konzept!L21","v":"Muster_1 Fkt."},{"$f":"B_I_Entw_Konzept!M21","v":"-"},null,{"$f":"Tab_IB_AusBildPer14[[#This Row],[I-B_Funktionen]]","v":"Muster_1 Fkt."},227,{"$f":"IF(ROW(C227)-ROW(C$219)+1>COUNT(Tab_IB_AusBildPer14[I-B_Zeile]),\"\",INDEX(F:F,SMALL(Tab_IB_AusBildPer14[I-B_Zeile],1+ROW(F227)-ROW($F$219))))","v":"Muster_1 Fkt."}]
[46,null,{"$f":"B_I_Entw_Konzept!N13","v":"Kompetenzen Verwaltungsfunktionär"},{"$f":"B_I_Entw_Konzept!O13","v":"-"},null,{"$f":"Tab_IB_AusBildPer14[[#This Row],[I-B_Funktionen]]","v":"Kompetenzen Verwaltungsfunktionär"},228,{"$f":"IF(ROW(C228)-ROW(C$219)+1>COUNT(Tab_IB_AusBildPer14[I-B_Zeile]),\"\",INDEX(F:F,SMALL(Tab_IB_AusBildPer14[I-B_Zeile],1+ROW(F228)-ROW($F$219))))","v":"Kompetenzen Verwaltungsfunktionär"}]
[47,null,{"$f":"B_I_Entw_Konzept!N14","v":"Fachwissen  Verwaltungsfunktionär"},{"$f":"B_I_Entw_Konzept!O14","v":"-"},null,{"$f":"Tab_IB_AusBildPer14[[#This Row],[I-B_Funktionen]]","v":"Fachwissen  Verwaltungsfunktionär"},229,{"$f":"IF(ROW(C229)-ROW(C$219)+1>COUNT(Tab_IB_AusBildPer14[I-B_Zeile]),\"\",INDEX(F:F,SMALL(Tab_IB_AusBildPer14[I-B_Zeile],1+ROW(F229)-ROW($F$219))))","v":"Fachwissen  Verwaltungsfunktionär"}]
[48,null,{"$f":"B_I_Entw_Konzept!N15","v":"Berufliche Fähigkeiten  Verw.Funktionär"},{"$f":"B_I_Entw_Konzept!O15","v":"-"},null,{"$f":"Tab_IB_AusBildPer14[[#This Row],[I-B_Funktionen]]","v":"Berufliche Fähigkeiten  Verw.Funktionär"},230,{"$f":"IF(ROW(C230)-ROW(C$219)+1>COUNT(Tab_IB_AusBildPer14[I-B_Zeile]),\"\",INDEX(F:F,SMALL(Tab_IB_AusBildPer14[I-B_Zeile],1+ROW(F230)-ROW($F$219))))","v":"Berufliche Fähigkeiten  Verw.Funktionär"}]
[49,null,{"$f":"B_I_Entw_Konzept!N16","v":"Soziale Kompetenz Verw_Fkt."},{"$f":"B_I_Entw_Konzept!O16","v":"-"},null,{"$f":"Tab_IB_AusBildPer14[[#This Row],[I-B_Funktionen]]","v":"Soziale Kompetenz Verw_Fkt."},231,{"$f":"IF(ROW(C231)-ROW(C$219)+1>COUNT(Tab_IB_AusBildPer14[I-B_Zeile]),\"\",INDEX(F:F,SMALL(Tab_IB_AusBildPer14[I-B_Zeile],1+ROW(F231)-ROW($F$219))))","v":"Soziale Kompetenz Verw_Fkt."}]
[50,null,{"$f":"B_I_Entw_Konzept!N17","v":"Weiterbildung Verw_Fkt."},{"$f":"B_I_Entw_Konzept!O17","v":"-"},null,{"$f":"Tab_IB_AusBildPer14[[#This Row],[I-B_Funktionen]]","v":"Weiterbildung Verw_Fkt."},232,{"$f":"IF(ROW(C232)-ROW(C$219)+1>COUNT(Tab_IB_AusBildPer14[I-B_Zeile]),\"\",INDEX(F:F,SMALL(Tab_IB_AusBildPer14[I-B_Zeile],1+ROW(F232)-ROW($F$219))))","v":"Weiterbildung Verw_Fkt."}]
[51,null,{"$f":"B_I_Entw_Konzept!N18","v":"Standing in der Region Verw_Fkt."},{"$f":"B_I_Entw_Konzept!O18","v":"-"},null,{"$f":"Tab_IB_AusBildPer14[[#This Row],[I-B_Funktionen]]","v":"Standing in der Region Verw_Fkt."},233,{"$f":"IF(ROW(C233)-ROW(C$219)+1>COUNT(Tab_IB_AusBildPer14[I-B_Zeile]),\"\",INDEX(F:F,SMALL(Tab_IB_AusBildPer14[I-B_Zeile],1+ROW(F233)-ROW($F$219))))","v":"Standing in der Region Verw_Fkt."}]
[52,null,{"$f":"B_I_Entw_Konzept!N19","v":"Zeitliche Ressourcen Verw_Fkt."},{"$f":"B_I_Entw_Konzept!O19","v":"-"},null,{"$f":"Tab_IB_AusBildPer14[[#This Row],[I-B_Funktionen]]","v":"Zeitliche Ressourcen Verw_Fkt."},234,{"$f":"IF(ROW(C234)-ROW(C$219)+1>COUNT(Tab_IB_AusBildPer14[I-B_Zeile]),\"\",INDEX(F:F,SMALL(Tab_IB_AusBildPer14[I-B_Zeile],1+ROW(F234)-ROW($F$219))))","v":"Zeitliche Ressourcen Verw_Fkt."}]
[53,null,{"$f":"B_I_Entw_Konzept!N20","v":"Identifikation Verw_Fkt."},{"$f":"B_I_Entw_Konzept!O20","v":"-"},null,{"$f":"Tab_IB_AusBildPer14[[#This Row],[I-B_Funktionen]]","v":"Identifikation Verw_Fkt."},235,{"$f":"IF(ROW(C235)-ROW(C$219)+1>COUNT(Tab_IB_AusBildPer14[I-B_Zeile]),\"\",INDEX(F:F,SMALL(Tab_IB_AusBildPer14[I-B_Zeile],1+ROW(F235)-ROW($F$219))))","v":"Identifikation Verw_Fkt."}]
[54,null,{"$f":"B_I_Entw_Konzept!N21","v":"Test-Muster_2 Verw_Fkt."},{"$f":"B_I_Entw_Konzept!O21","v":"-"},null,{"$f":"Tab_IB_AusBildPer14[[#This Row],[I-B_Funktionen]]","v":"Test-Muster_2 Verw_Fkt."},236,{"$f":"IF(ROW(C236)-ROW(C$219)+1>COUNT(Tab_IB_AusBildPer14[I-B_Zeile]),\"\",INDEX(F:F,SMALL(Tab_IB_AusBildPer14[I-B_Zeile],1+ROW(F236)-ROW($F$219))))","v":"Test-Muster_2 Verw_Fkt."}]
[55,null,{"$f":"B_I_Entw_Konzept!P13","v":"Kompetenzen Sportfunktionär"},{"$f":"B_I_Entw_Konzept!Q13","v":"-"},null,{"$f":"Tab_IB_AusBildPer14[[#This Row],[I-B_Funktionen]]","v":"Kompetenzen Sportfunktionär"},237,{"$f":"IF(ROW(C237)-ROW(C$219)+1>COUNT(Tab_IB_AusBildPer14[I-B_Zeile]),\"\",INDEX(F:F,SMALL(Tab_IB_AusBildPer14[I-B_Zeile],1+ROW(F237)-ROW($F$219))))","v":"Kompetenzen Sportfunktionär"}]
[56,null,{"$f":"B_I_Entw_Konzept!P14","v":"Fachwissen Sportfunktionär"},{"$f":"B_I_Entw_Konzept!Q14","v":"-"},null,{"$f":"Tab_IB_AusBildPer14[[#This Row],[I-B_Funktionen]]","v":"Fachwissen Sportfunktionär"},238,{"$f":"IF(ROW(C238)-ROW(C$219)+1>COUNT(Tab_IB_AusBildPer14[I-B_Zeile]),\"\",INDEX(F:F,SMALL(Tab_IB_AusBildPer14[I-B_Zeile],1+ROW(F238)-ROW($F$219))))","v":"Fachwissen Sportfunktionär"}]
[57,null,{"$f":"B_I_Entw_Konzept!P15","v":"Berufliche Fähigkeiten Sportfunktionär"},{"$f":"B_I_Entw_Konzept!Q15","v":"-"},null,{"$f":"Tab_IB_AusBildPer14[[#This Row],[I-B_Funktionen]]","v":"Berufliche Fähigkeiten Sportfunktionär"},239,{"$f":"IF(ROW(C239)-ROW(C$219)+1>COUNT(Tab_IB_AusBildPer14[I-B_Zeile]),\"\",INDEX(F:F,SMALL(Tab_IB_AusBildPer14[I-B_Zeile],1+ROW(F239)-ROW($F$219))))","v":"Berufliche Fähigkeiten Sportfunktionär"}]
[58,null,{"$f":"B_I_Entw_Konzept!P16","v":"Soziale Kompetenz Sp_Fkt."},{"$f":"B_I_Entw_Konzept!Q16","v":"-"},null,{"$f":"Tab_IB_AusBildPer14[[#This Row],[I-B_Funktionen]]","v":"Soziale Kompetenz Sp_Fkt."},240,{"$f":"IF(ROW(C240)-ROW(C$219)+1>COUNT(Tab_IB_AusBildPer14[I-B_Zeile]),\"\",INDEX(F:F,SMALL(Tab_IB_AusBildPer14[I-B_Zeile],1+ROW(F240)-ROW($F$219))))","v":"Soziale Kompetenz Sp_Fkt."}]
[59,null,{"$f":"B_I_Entw_Konzept!P17","v":"Weiterbildung Sp_Fkt."},{"$f":"B_I_Entw_Konzept!Q17","v":"-"},null,{"$f":"Tab_IB_AusBildPer14[[#This Row],[I-B_Funktionen]]","v":"Weiterbildung Sp_Fkt."},241,{"$f":"IF(ROW(C241)-ROW(C$219)+1>COUNT(Tab_IB_AusBildPer14[I-B_Zeile]),\"\",INDEX(F:F,SMALL(Tab_IB_AusBildPer14[I-B_Zeile],1+ROW(F241)-ROW($F$219))))","v":"Weiterbildung Sp_Fkt."}]
[60,null,{"$f":"B_I_Entw_Konzept!P18","v":"Standing in der Region Sp_Fkt."},{"$f":"B_I_Entw_Konzept!Q18","v":"-"},null,{"$f":"Tab_IB_AusBildPer14[[#This Row],[I-B_Funktionen]]","v":"Standing in der Region Sp_Fkt."},242,{"$f":"IF(ROW(C242)-ROW(C$219)+1>COUNT(Tab_IB_AusBildPer14[I-B_Zeile]),\"\",INDEX(F:F,SMALL(Tab_IB_AusBildPer14[I-B_Zeile],1+ROW(F242)-ROW($F$219))))","v":"Standing in der Region Sp_Fkt."}]
[61,null,{"$f":"B_I_Entw_Konzept!P19","v":"Zeitliche Ressourcen Sp_Fkt."},{"$f":"B_I_Entw_Konzept!Q19","v":"-"},null,{"$f":"Tab_IB_AusBildPer14[[#This Row],[I-B_Funktionen]]","v":"Zeitliche Ressourcen Sp_Fkt."},243,{"$f":"IF(ROW(C243)-ROW(C$219)+1>COUNT(Tab_IB_AusBildPer14[I-B_Zeile]),\"\",INDEX(F:F,SMALL(Tab_IB_AusBildPer14[I-B_Zeile],1+ROW(F243)-ROW($F$219))))","v":"Zeitliche Ressourcen Sp_Fkt."}]
[62,null,{"$f":"B_I_Entw_Konzept!P20","v":"Identifikation Sp_Fkt."},{"$f":"B_I_Entw_Konzept!Q20","v":"-"},null,{"$f":"Tab_IB_AusBildPer14[[#This Row],[I-B_Funktionen]]","v":"Identifikation Sp_Fkt."},244,{"$f":"IF(ROW(C244)-ROW(C$219)+1>COUNT(Tab_IB_AusBildPer14[I-B_Zeile]),\"\",INDEX(F:F,SMALL(Tab_IB_AusBildPer14[I-B_Zeile],1+ROW(F244)-ROW($F$219))))","v":"Identifikation Sp_Fkt."}]
[63,null,{"$f":"B_I_Entw_Konzept!P21","v":"Test-Muster_3 Sp_Fkt."},{"$f":"B_I_Entw_Konzept!Q21","v":"-"},null,{"$f":"Tab_IB_AusBildPer14[[#This Row],[I-B_Funktionen]]","v":"Test-Muster_3 Sp_Fkt."},245,{"$f":"IF(ROW(C245)-ROW(C$219)+1>COUNT(Tab_IB_AusBildPer14[I-B_Zeile]),\"\",INDEX(F:F,SMALL(Tab_IB_AusBildPer14[I-B_Zeile],1+ROW(F245)-ROW($F$219))))","v":"Test-Muster_3 Sp_Fkt."}]
[64,null,{"$f":"B_I_Entw_Konzept!R13","v":"Kompetenzen Vermarktungsfunktionär"},{"$f":"B_I_Entw_Konzept!S13","v":"-"},null,{"$f":"Tab_IB_AusBildPer14[[#This Row],[I-B_Funktionen]]","v":"Kompetenzen Vermarktungsfunktionär"},246,{"$f":"IF(ROW(C246)-ROW(C$219)+1>COUNT(Tab_IB_AusBildPer14[I-B_Zeile]),\"\",INDEX(F:F,SMALL(Tab_IB_AusBildPer14[I-B_Zeile],1+ROW(F246)-ROW($F$219))))","v":"Kompetenzen Vermarktungsfunktionär"}]
[65,null,{"$f":"B_I_Entw_Konzept!R14","v":"Fachwissen Vermarktungsfunktionär"},{"$f":"B_I_Entw_Konzept!S14","v":"-"},null,{"$f":"Tab_IB_AusBildPer14[[#This Row],[I-B_Funktionen]]","v":"Fachwissen Vermarktungsfunktionär"},247,{"$f":"IF(ROW(C247)-ROW(C$219)+1>COUNT(Tab_IB_AusBildPer14[I-B_Zeile]),\"\",INDEX(F:F,SMALL(Tab_IB_AusBildPer14[I-B_Zeile],1+ROW(F247)-ROW($F$219))))","v":"Fachwissen Vermarktungsfunktionär"}]
[66,null,{"$f":"B_I_Entw_Konzept!R15","v":"Berufliche Fähigkeiten Verm.Funktionär"},{"$f":"B_I_Entw_Konzept!S15","v":"-"},null,{"$f":"Tab_IB_AusBildPer14[[#This Row],[I-B_Funktionen]]","v":"Berufliche Fähigkeiten Verm.Funktionär"},248,{"$f":"IF(ROW(C248)-ROW(C$219)+1>COUNT(Tab_IB_AusBildPer14[I-B_Zeile]),\"\",INDEX(F:F,SMALL(Tab_IB_AusBildPer14[I-B_Zeile],1+ROW(F248)-ROW($F$219))))","v":"Berufliche Fähigkeiten Verm.Funktionär"}]
[67,null,{"$f":"B_I_Entw_Konzept!R16","v":"Soziale Kompetenz  Vermarktungsfunktionär"},{"$f":"B_I_Entw_Konzept!S16","v":"-"},null,{"$f":"Tab_IB_AusBildPer14[[#This Row],[I-B_Funktionen]]","v":"Soziale Kompetenz  Vermarktungsfunktionär"},249,{"$f":"IF(ROW(C249)-ROW(C$219)+1>COUNT(Tab_IB_AusBildPer14[I-B_Zeile]),\"\",INDEX(F:F,SMALL(Tab_IB_AusBildPer14[I-B_Zeile],1+ROW(F249)-ROW($F$219))))","v":"Soziale Kompetenz  Vermarktungsfunktionär"}]
[68,null,{"$f":"B_I_Entw_Konzept!R17","v":"Weiterbildung Vermarktungsfunktionär"},{"$f":"B_I_Entw_Konzept!S17","v":"-"},null,{"$f":"Tab_IB_AusBildPer14[[#This Row],[I-B_Funktionen]]","v":"Weiterbildung Vermarktungsfunktionär"},250,{"$f":"IF(ROW(C250)-ROW(C$219)+1>COUNT(Tab_IB_AusBildPer14[I-B_Zeile]),\"\",INDEX(F:F,SMALL(Tab_IB_AusBildPer14[I-B_Zeile],1+ROW(F250)-ROW($F$219))))","v":"Weiterbildung Vermarktungsfunktionär"}]
[69,null,{"$f":"B_I_Entw_Konzept!R18","v":"Standing in der Region Verm_Fkt."},{"$f":"B_I_Entw_Konzept!S18","v":"-"},null,{"$f":"Tab_IB_AusBildPer14[[#This Row],[I-B_Funktionen]]","v":"Standing in der Region Verm_Fkt."},251,{"$f":"IF(ROW(C251)-ROW(C$219)+1>COUNT(Tab_IB_AusBildPer14[I-B_Zeile]),\"\",INDEX(F:F,SMALL(Tab_IB_AusBildPer14[I-B_Zeile],1+ROW(F251)-ROW($F$219))))","v":"Standing in der Region Verm_Fkt."}]
[70,null,{"$f":"B_I_Entw_Konzept!R19","v":"Zeitliche Ressourcen Verm_Fkt."},{"$f":"B_I_Entw_Konzept!S19","v":"-"},null,{"$f":"Tab_IB_AusBildPer14[[#This Row],[I-B_Funktionen]]","v":"Zeitliche Ressourcen Verm_Fkt."},252,{"$f":"IF(ROW(C252)-ROW(C$219)+1>COUNT(Tab_IB_AusBildPer14[I-B_Zeile]),\"\",INDEX(F:F,SMALL(Tab_IB_AusBildPer14[I-B_Zeile],1+ROW(F252)-ROW($F$219))))","v":"Zeitliche Ressourcen Verm_Fkt."}]
[71,null,{"$f":"B_I_Entw_Konzept!R20","v":"Identifikation Verm_Fkt."},{"$f":"B_I_Entw_Konzept!S20","v":"-"},null,{"$f":"Tab_IB_AusBildPer14[[#This Row],[I-B_Funktionen]]","v":"Identifikation Verm_Fkt."},253,{"$f":"IF(ROW(C253)-ROW(C$219)+1>COUNT(Tab_IB_AusBildPer14[I-B_Zeile]),\"\",INDEX(F:F,SMALL(Tab_IB_AusBildPer14[I-B_Zeile],1+ROW(F253)-ROW($F$219))))","v":"Identifikation Verm_Fkt."}]
[72,null,{"$f":"B_I_Entw_Konzept!R21","v":"Test Verm_Fkt."},{"$f":"B_I_Entw_Konzept!S21","v":"-"},null,{"$f":"Tab_IB_AusBildPer14[[#This Row],[I-B_Funktionen]]","v":"Test Verm_Fkt."},254,{"$f":"IF(ROW(C254)-ROW(C$219)+1>COUNT(Tab_IB_AusBildPer14[I-B_Zeile]),\"\",INDEX(F:F,SMALL(Tab_IB_AusBildPer14[I-B_Zeile],1+ROW(F254)-ROW($F$219))))","v":"Test Verm_Fkt."}]
[]
["L_Nr.","II. Verwaltungskonzept","II-C_Funktionen","II-C_Werte","II-C_100%","II-C_Funktion","II-C_Zeile","II-C_noch möglich"]
[73,{"$f":"B_II_Verw_Konzept!B5","v":"C. Verwaltungsperspektive"},{"$f":"B_II_Verw_Konzept!L2","v":"Effektive Verwaltung_1"},{"$f":"B_II_Verw_Konzept!M2","v":"-"},null,{"$f":"Tab_IIC_VerwaPer15[[#This Row],[II-C_Funktionen]]","v":"Effektive Verwaltung_1"},{"$f":"IF(COUNTIF($C$53:$C$64,F257)>=1,\"\",ROW())","v":257},{"$f":"IF(ROW(C257)-ROW(C$257)+1>COUNT(Tab_IIC_VerwaPer15[II-C_Zeile]),\"\",INDEX(F:F,SMALL(Tab_IIC_VerwaPer15[II-C_Zeile],1+ROW(F257)-ROW($F$257))))","v":"Effektive Verwaltung_1"}]
[74,null,{"$f":"B_II_Verw_Konzept!L3","v":"Effektive Verwaltung_2"},{"$f":"B_II_Verw_Konzept!M3","v":"-"},null,{"$f":"Tab_IIC_VerwaPer15[[#This Row],[II-C_Funktionen]]","v":"Effektive Verwaltung_2"},258,{"$f":"IF(ROW(C258)-ROW(C$257)+1>COUNT(Tab_IIC_VerwaPer15[II-C_Zeile]),\"\",INDEX(F:F,SMALL(Tab_IIC_VerwaPer15[II-C_Zeile],1+ROW(F258)-ROW($F$257))))","v":"Effektive Verwaltung_2"}]
[75,null,{"$f":"B_II_Verw_Konzept!L4","v":"Effektive Verwaltung_3"},{"$f":"B_II_Verw_Konzept!M4","v":"-"},null,{"$f":"Tab_IIC_VerwaPer15[[#This Row],[II-C_Funktionen]]","v":"Effektive Verwaltung_3"},259,{"$f":"IF(ROW(C259)-ROW(C$257)+1>COUNT(Tab_IIC_VerwaPer15[II-C_Zeile]),\"\",INDEX(F:F,SMALL(Tab_IIC_VerwaPer15[II-C_Zeile],1+ROW(F259)-ROW($F$257))))","v":"Effektive Verwaltung_3"}]
[76,null,{"$f":"B_II_Verw_Konzept!L5","v":"Effektive Verwaltung_4"},{"$f":"B_II_Verw_Konzept!M5","v":"-"},null,{"$f":"Tab_IIC_VerwaPer15[[#This Row],[II-C_Funktionen]]","v":"Effektive Verwaltung_4"},260,{"$f":"IF(ROW(C260)-ROW(C$257)+1>COUNT(Tab_IIC_VerwaPer15[II-C_Zeile]),\"\",INDEX(F:F,SMALL(Tab_IIC_VerwaPer15[II-C_Zeile],1+ROW(F260)-ROW($F$257))))","v":"Effektive Verwaltung_4"}]
[77,null,{"$f":"B_II_Verw_Konzept!L6","v":"Effektive Verwaltung_5"},{"$f":"B_II_Verw_Konzept!M6","v":"-"},null,{"$f":"Tab_IIC_VerwaPer15[[#This Row],[II-C_Funktionen]]","v":"Effektive Verwaltung_5"},261,{"$f":"IF(ROW(C261)-ROW(C$257)+1>COUNT(Tab_IIC_VerwaPer15[II-C_Zeile]),\"\",INDEX(F:F,SMALL(Tab_IIC_VerwaPer15[II-C_Zeile],1+ROW(F261)-ROW($F$257))))","v":"Effektive Verwaltung_5"}]
[78,null,{"$f":"B_II_Verw_Konzept!L7","v":"Effektive Verwaltung_6"},{"$f":"B_II_Verw_Konzept!M7","v":"-"},null,{"$f":"Tab_IIC_VerwaPer15[[#This Row],[II-C_Funktionen]]","v":"Effektive Verwaltung_6"},262,{"$f":"IF(ROW(C262)-ROW(C$257)+1>COUNT(Tab_IIC_VerwaPer15[II-C_Zeile]),\"\",INDEX(F:F,SMALL(Tab_IIC_VerwaPer15[II-C_Zeile],1+ROW(F262)-ROW($F$257))))","v":"Effektive Verwaltung_6"}]
[79,null,{"$f":"B_II_Verw_Konzept!L8","v":"Effektive Verwaltung_7"},{"$f":"B_II_Verw_Konzept!M8","v":"-"},null,{"$f":"Tab_IIC_VerwaPer15[[#This Row],[II-C_Funktionen]]","v":"Effektive Verwaltung_7"},263,{"$f":"IF(ROW(C263)-ROW(C$257)+1>COUNT(Tab_IIC_VerwaPer15[II-C_Zeile]),\"\",INDEX(F:F,SMALL(Tab_IIC_VerwaPer15[II-C_Zeile],1+ROW(F263)-ROW($F$257))))","v":"Effektive Verwaltung_7"}]
[80,null,{"$f":"B_II_Verw_Konzept!L9","v":"Effektive Verwaltung_8"},{"$f":"B_II_Verw_Konzept!M9","v":"-"},null,{"$f":"Tab_IIC_VerwaPer15[[#This Row],[II-C_Funktionen]]","v":"Effektive Verwaltung_8"},264,{"$f":"IF(ROW(C264)-ROW(C$257)+1>COUNT(Tab_IIC_VerwaPer15[II-C_Zeile]),\"\",INDEX(F:F,SMALL(Tab_IIC_VerwaPer15[II-C_Zeile],1+ROW(F264)-ROW($F$257))))","v":"Effektive Verwaltung_8"}]
[81,null,{"$f":"B_II_Verw_Konzept!L10","v":"Effektive Verwaltung_9"},{"$f":"B_II_Verw_Konzept!M10","v":"-"},null,{"$f":"Tab_IIC_VerwaPer15[[#This Row],[II-C_Funktionen]]","v":"Effektive Verwaltung_9"},265,{"$f":"IF(ROW(C265)-ROW(C$257)+1>COUNT(Tab_IIC_VerwaPer15[II-C_Zeile]),\"\",INDEX(F:F,SMALL(Tab_IIC_VerwaPer15[II-C_Zeile],1+ROW(F265)-ROW($F$257))))","v":"Effektive Verwaltung_9"}]
[82,null,{"$f":"B_II_Verw_Konzept!N2","v":"Rahmenbedingungen"},{"$f":"B_II_Verw_Konzept!O2","v":"-"},null,{"$f":"Tab_IIC_VerwaPer15[[#This Row],[II-C_Funktionen]]","v":"Rahmenbedingungen"},266,{"$f":"IF(ROW(C266)-ROW(C$257)+1>COUNT(Tab_IIC_VerwaPer15[II-C_Zeile]),\"\",INDEX(F:F,SMALL(Tab_IIC_VerwaPer15[II-C_Zeile],1+ROW(F266)-ROW($F$257))))","v":"Rahmenbedingungen"}]
[83,null,{"$f":"B_II_Verw_Konzept!N3","v":"Rahmenbedingungen_2"},{"$f":"B_II_Verw_Konzept!O3","v":"-"},null,{"$f":"Tab_IIC_VerwaPer15[[#This Row],[II-C_Funktionen]]","v":"Rahmenbedingungen_2"},267,{"$f":"IF(ROW(C267)-ROW(C$257)+1>COUNT(Tab_IIC_VerwaPer15[II-C_Zeile]),\"\",INDEX(F:F,SMALL(Tab_IIC_VerwaPer15[II-C_Zeile],1+ROW(F267)-ROW($F$257))))","v":"Rahmenbedingungen_2"}]
[84,null,{"$f":"B_II_Verw_Konzept!N4","v":"Rahmenbedingungen_3"},{"$f":"B_II_Verw_Konzept!O4","v":"-"},null,{"$f":"Tab_IIC_VerwaPer15[[#This Row],[II-C_Funktionen]]","v":"Rahmenbedingungen_3"},268,{"$f":"IF(ROW(C268)-ROW(C$257)+1>COUNT(Tab_IIC_VerwaPer15[II-C_Zeile]),\"\",INDEX(F:F,SMALL(Tab_IIC_VerwaPer15[II-C_Zeile],1+ROW(F268)-ROW($F$257))))","v":"Rahmenbedingungen_3"}]
[85,null,{"$f":"B_II_Verw_Konzept!N5","v":"Rahmenbedingungen_4"},{"$f":"B_II_Verw_Konzept!O5","v":"-"},null,{"$f":"Tab_IIC_VerwaPer15[[#This Row],[II-C_Funktionen]]","v":"Rahmenbedingungen_4"},269,{"$f":"IF(ROW(C269)-ROW(C$257)+1>COUNT(Tab_IIC_VerwaPer15[II-C_Zeile]),\"\",INDEX(F:F,SMALL(Tab_IIC_VerwaPer15[II-C_Zeile],1+ROW(F269)-ROW($F$257))))","v":"Rahmenbedingungen_4"}]
[86,null,{"$f":"B_II_Verw_Konzept!N6","v":"Rahmenbedingungen_5"},{"$f":"B_II_Verw_Konzept!O6","v":"-"},null,{"$f":"Tab_IIC_VerwaPer15[[#This Row],[II-C_Funktionen]]","v":"Rahmenbedingungen_5"},270,{"$f":"IF(ROW(C270)-ROW(C$257)+1>COUNT(Tab_IIC_VerwaPer15[II-C_Zeile]),\"\",INDEX(F:F,SMALL(Tab_IIC_VerwaPer15[II-C_Zeile],1+ROW(F270)-ROW($F$257))))","v":"Rahmenbedingungen_5"}]
[87,null,{"$f":"B_II_Verw_Konzept!N7","v":"Rahmenbedingungen_6"},{"$f":"B_II_Verw_Konzept!O7","v":"-"},null,{"$f":"Tab_IIC_VerwaPer15[[#This Row],[II-C_Funktionen]]","v":"Rahmenbedingungen_6"},271,{"$f":"IF(ROW(C271)-ROW(C$257)+1>COUNT(Tab_IIC_VerwaPer15[II-C_Zeile]),\"\",INDEX(F:F,SMALL(Tab_IIC_VerwaPer15[II-C_Zeile],1+ROW(F271)-ROW($F$257))))","v":"Rahmenbedingungen_6"}]
[88,null,{"$f":"B_II_Verw_Konzept!N8","v":"Rahmenbedingungen_7"},{"$f":"B_II_Verw_Konzept!O8","v":"-"},null,{"$f":"Tab_IIC_VerwaPer15[[#This Row],[II-C_Funktionen]]","v":"Rahmenbedingungen_7"},272,{"$f":"IF(ROW(C272)-ROW(C$257)+1>COUNT(Tab_IIC_VerwaPer15[II-C_Zeile]),\"\",INDEX(F:F,SMALL(Tab_IIC_VerwaPer15[II-C_Zeile],1+ROW(F272)-ROW($F$257))))","v":"Rahmenbedingungen_7"}]
[89,null,{"$f":"B_II_Verw_Konzept!N9","v":"Rahmenbedingungen_8"},{"$f":"B_II_Verw_Konzept!O9","v":"-"},null,{"$f":"Tab_IIC_VerwaPer15[[#This Row],[II-C_Funktionen]]","v":"Rahmenbedingungen_8"},273,{"$f":"IF(ROW(C273)-ROW(C$257)+1>COUNT(Tab_IIC_VerwaPer15[II-C_Zeile]),\"\",INDEX(F:F,SMALL(Tab_IIC_VerwaPer15[II-C_Zeile],1+ROW(F273)-ROW($F$257))))","v":"Rahmenbedingungen_8"}]
[90,null,{"$f":"B_II_Verw_Konzept!N10","v":"Rahmenbedingungen_9"},{"$f":"B_II_Verw_Konzept!O10","v":"-"},null,{"$f":"Tab_IIC_VerwaPer15[[#This Row],[II-C_Funktionen]]","v":"Rahmenbedingungen_9"},274,{"$f":"IF(ROW(C274)-ROW(C$257)+1>COUNT(Tab_IIC_VerwaPer15[II-C_Zeile]),\"\",INDEX(F:F,SMALL(Tab_IIC_VerwaPer15[II-C_Zeile],1+ROW(F274)-ROW($F$257))))","v":"Rahmenbedingungen_9"}]
[91,null,{"$f":"B_II_Verw_Konzept!P2","v":"Strukturen"},{"$f":"B_II_Verw_Konzept!Q2","v":"-"},null,{"$f":"Tab_IIC_VerwaPer15[[#This Row],[II-C_Funktionen]]","v":"Strukturen"},275,{"$f":"IF(ROW(C275)-ROW(C$257)+1>COUNT(Tab_IIC_VerwaPer15[II-C_Zeile]),\"\",INDEX(F:F,SMALL(Tab_IIC_VerwaPer15[II-C_Zeile],1+ROW(F275)-ROW($F$257))))","v":"Strukturen"}]
[92,null,{"$f":"B_II_Verw_Konzept!P3","v":"Infrastruktur_2"},{"$f":"B_II_Verw_Konzept!Q3","v":"-"},null,{"$f":"Tab_IIC_VerwaPer15[[#This Row],[II-C_Funktionen]]","v":"Infrastruktur_2"},276,{"$f":"IF(ROW(C276)-ROW(C$257)+1>COUNT(Tab_IIC_VerwaPer15[II-C_Zeile]),\"\",INDEX(F:F,SMALL(Tab_IIC_VerwaPer15[II-C_Zeile],1+ROW(F276)-ROW($F$257))))","v":"Infrastruktur_2"}]
[93,null,{"$f":"B_II_Verw_Konzept!P4","v":"Infrastruktur_3"},{"$f":"B_II_Verw_Konzept!Q4","v":"-"},null,{"$f":"Tab_IIC_VerwaPer15[[#This Row],[II-C_Funktionen]]","v":"Infrastruktur_3"},277,{"$f":"IF(ROW(C277)-ROW(C$257)+1>COUNT(Tab_IIC_VerwaPer15[II-C_Zeile]),\"\",INDEX(F:F,SMALL(Tab_IIC_VerwaPer15[II-C_Zeile],1+ROW(F277)-ROW($F$257))))","v":"Infrastruktur_3"}]
[94,null,{"$f":"B_II_Verw_Konzept!P5","v":"Infrastruktur_4"},{"$f":"B_II_Verw_Konzept!Q5","v":"-"},null,{"$f":"Tab_IIC_VerwaPer15[[#This Row],[II-C_Funktionen]]","v":"Infrastruktur_4"},278,{"$f":"IF(ROW(C278)-ROW(C$257)+1>COUNT(Tab_IIC_VerwaPer15[II-C_Zeile]),\"\",INDEX(F:F,SMALL(Tab_IIC_VerwaPer15[II-C_Zeile],1+ROW(F278)-ROW($F$257))))","v":"Infrastruktur_4"}]
[95,null,{"$f":"B_II_Verw_Konzept!P6","v":"Infrastruktur_5"},{"$f":"B_II_Verw_Konzept!Q6","v":"-"},null,{"$f":"Tab_IIC_VerwaPer15[[#This Row],[II-C_Funktionen]]","v":"Infrastruktur_5"},279,{"$f":"IF(ROW(C279)-ROW(C$257)+1>COUNT(Tab_IIC_VerwaPer15[II-C_Zeile]),\"\",INDEX(F:F,SMALL(Tab_IIC_VerwaPer15[II-C_Zeile],1+ROW(F279)-ROW($F$257))))","v":"Infrastruktur_5"}]
[96,null,{"$f":"B_II_Verw_Konzept!P7","v":"Infrastruktur_6"},{"$f":"B_II_Verw_Konzept!Q7","v":"-"},null,{"$f":"Tab_IIC_VerwaPer15[[#This Row],[II-C_Funktionen]]","v":"Infrastruktur_6"},280,{"$f":"IF(ROW(C280)-ROW(C$257)+1>COUNT(Tab_IIC_VerwaPer15[II-C_Zeile]),\"\",INDEX(F:F,SMALL(Tab_IIC_VerwaPer15[II-C_Zeile],1+ROW(F280)-ROW($F$257))))","v":"Infrastruktur_6"}]
[97,null,{"$f":"B_II_Verw_Konzept!P8","v":"Infrastruktur_7"},{"$f":"B_II_Verw_Konzept!Q8","v":"-"},null,{"$f":"Tab_IIC_VerwaPer15[[#This Row],[II-C_Funktionen]]","v":"Infrastruktur_7"},281,{"$f":"IF(ROW(C281)-ROW(C$257)+1>COUNT(Tab_IIC_VerwaPer15[II-C_Zeile]),\"\",INDEX(F:F,SMALL(Tab_IIC_VerwaPer15[II-C_Zeile],1+ROW(F281)-ROW($F$257))))","v":"Infrastruktur_7"}]
[98,null,{"$f":"B_II_Verw_Konzept!P9","v":"Infrastruktur_8"},{"$f":"B_II_Verw_Konzept!Q9","v":"-"},null,{"$f":"Tab_IIC_VerwaPer15[[#This Row],[II-C_Funktionen]]","v":"Infrastruktur_8"},282,{"$f":"IF(ROW(C282)-ROW(C$257)+1>COUNT(Tab_IIC_VerwaPer15[II-C_Zeile]),\"\",INDEX(F:F,SMALL(Tab_IIC_VerwaPer15[II-C_Zeile],1+ROW(F282)-ROW($F$257))))","v":"Infrastruktur_8"}]
[99,null,{"$f":"B_II_Verw_Konzept!P10","v":"Infrastruktur_9"},{"$f":"B_II_Verw_Konzept!Q10","v":"-"},null,{"$f":"Tab_IIC_VerwaPer15[[#This Row],[II-C_Funktionen]]","v":"Infrastruktur_9"},283,{"$f":"IF(ROW(C283)-ROW(C$257)+1>COUNT(Tab_IIC_VerwaPer15[II-C_Zeile]),\"\",INDEX(F:F,SMALL(Tab_IIC_VerwaPer15[II-C_Zeile],1+ROW(F283)-ROW($F$257))))","v":"Infrastruktur_9"}]
[]
["L_Nr.","II. Verwaltungskonzept","II-D_Funktionen","II-D_Werte","II-D_100%","II-D_Funktion","II-D_Zeile","II-D_noch möglich"]
[100,{"$f":"B_II_Verw_Konzept!B6","v":"D. Finanzperspektive"},{"$f":"B_II_Verw_Konzept!L13","v":"BVer1 - Sponsorenanteil am Budget steigt"},{"$f":"B_II_Verw_Konzept!M13","v":"-"},null,{"$f":"Tab_IID_FinanzPer16[[#This Row],[II-D_Funktionen]]","v":"BVer1 - Sponsorenanteil am Budget steigt"},{"$f":"IF(COUNTIF($C$65:$C$76,F286)>=1,\"\",ROW())","v":286},{"$f":"IF(ROW(C286)-ROW(C$286)+1>COUNT(Tab_IID_FinanzPer16[II-D_Zeile]),\"\",INDEX(F:F,SMALL(Tab_IID_FinanzPer16[II-D_Zeile],1+ROW(F286)-ROW($F$286))))","v":"BVer1 - Sponsorenanteil am Budget steigt"}]
[101,null,{"$f":"B_II_Verw_Konzept!L14","v":"BVer3 - Zahlungsüberschuss (Cash Flow) steigt"},{"$f":"B_II_Verw_Konzept!M14","v":"-"},null,{"$f":"Tab_IID_FinanzPer16[[#This Row],[II-D_Funktionen]]","v":"BVer3 - Zahlungsüberschuss (Cash Flow) steigt"},{"$f":"IF(COUNTIF($C$65:$C$76,F287)>=1,\"\",ROW())","v":287},{"$f":"IF(ROW(C287)-ROW(C$286)+1>COUNT(Tab_IID_FinanzPer16[II-D_Zeile]),\"\",INDEX(F:F,SMALL(Tab_IID_FinanzPer16[II-D_Zeile],1+ROW(F287)-ROW($F$286))))","v":"BVer3 - Zahlungsüberschuss (Cash Flow) steigt"}]
[102,null,{"$f":"B_II_Verw_Konzept!L15","v":"Mitgliedsbeiträge steigen"},{"$f":"B_II_Verw_Konzept!M15","v":"-"},null,{"$f":"Tab_IID_FinanzPer16[[#This Row],[II-D_Funktionen]]","v":"Mitgliedsbeiträge steigen"},288,{"$f":"IF(ROW(C288)-ROW(C$286)+1>COUNT(Tab_IID_FinanzPer16[II-D_Zeile]),\"\",INDEX(F:F,SMALL(Tab_IID_FinanzPer16[II-D_Zeile],1+ROW(F288)-ROW($F$286))))","v":"Mitgliedsbeiträge steigen"}]
[103,null,{"$f":"B_II_Verw_Konzept!L16","v":"Subventionen Gemeinde"},{"$f":"B_II_Verw_Konzept!M16","v":"-"},null,{"$f":"Tab_IID_FinanzPer16[[#This Row],[II-D_Funktionen]]","v":"Subventionen Gemeinde"},289,{"$f":"IF(ROW(C289)-ROW(C$286)+1>COUNT(Tab_IID_FinanzPer16[II-D_Zeile]),\"\",INDEX(F:F,SMALL(Tab_IID_FinanzPer16[II-D_Zeile],1+ROW(F289)-ROW($F$286))))","v":"Subventionen Gemeinde"}]
[104,null,{"$f":"B_II_Verw_Konzept!L17","v":"Sponsoren"},{"$f":"B_II_Verw_Konzept!M17","v":"-"},null,{"$f":"Tab_IID_FinanzPer16[[#This Row],[II-D_Funktionen]]","v":"Sponsoren"},290,{"$f":"IF(ROW(C290)-ROW(C$286)+1>COUNT(Tab_IID_FinanzPer16[II-D_Zeile]),\"\",INDEX(F:F,SMALL(Tab_IID_FinanzPer16[II-D_Zeile],1+ROW(F290)-ROW($F$286))))","v":"Sponsoren"}]
[105,null,{"$f":"B_II_Verw_Konzept!L18","v":"Partnerschaften"},{"$f":"B_II_Verw_Konzept!M18","v":"-"},null,{"$f":"Tab_IID_FinanzPer16[[#This Row],[II-D_Funktionen]]","v":"Partnerschaften"},291,{"$f":"IF(ROW(C291)-ROW(C$286)+1>COUNT(Tab_IID_FinanzPer16[II-D_Zeile]),\"\",INDEX(F:F,SMALL(Tab_IID_FinanzPer16[II-D_Zeile],1+ROW(F291)-ROW($F$286))))","v":"Partnerschaften"}]
[106,null,{"$f":"B_II_Verw_Konzept!L19","v":"Subventionen Verband/Land"},{"$f":"B_II_Verw_Konzept!M19","v":"-"},null,{"$f":"Tab_IID_FinanzPer16[[#This Row],[II-D_Funktionen]]","v":"Subventionen Verband/Land"},292,{"$f":"IF(ROW(C292)-ROW(C$286)+1>COUNT(Tab_IID_FinanzPer16[II-D_Zeile]),\"\",INDEX(F:F,SMALL(Tab_IID_FinanzPer16[II-D_Zeile],1+ROW(F292)-ROW($F$286))))","v":"Subventionen Verband/Land"}]
[107,null,{"$f":"B_II_Verw_Konzept!L20","v":"Subventionen steigen"},{"$f":"B_II_Verw_Konzept!M20","v":"-"},null,{"$f":"Tab_IID_FinanzPer16[[#This Row],[II-D_Funktionen]]","v":"Subventionen steigen"},293,{"$f":"IF(ROW(C293)-ROW(C$286)+1>COUNT(Tab_IID_FinanzPer16[II-D_Zeile]),\"\",INDEX(F:F,SMALL(Tab_IID_FinanzPer16[II-D_Zeile],1+ROW(F293)-ROW($F$286))))","v":"Subventionen steigen"}]
[108,null,{"$f":"B_II_Verw_Konzept!L21","v":"Unterstützer"},{"$f":"B_II_Verw_Konzept!M21","v":"-"},null,{"$f":"Tab_IID_FinanzPer16[[#This Row],[II-D_Funktionen]]","v":"Unterstützer"},294,{"$f":"IF(ROW(C294)-ROW(C$286)+1>COUNT(Tab_IID_FinanzPer16[II-D_Zeile]),\"\",INDEX(F:F,SMALL(Tab_IID_FinanzPer16[II-D_Zeile],1+ROW(F294)-ROW($F$286))))","v":"Unterstützer"}]
[109,null,{"$f":"B_II_Verw_Konzept!N13","v":"BVer2 - Spieltagsumsatz steigt"},{"$f":"B_II_Verw_Konzept!O13","v":"-"},null,{"$f":"Tab_IID_FinanzPer16[[#This Row],[II-D_Funktionen]]","v":"BVer2 - Spieltagsumsatz steigt"},295,{"$f":"IF(ROW(C295)-ROW(C$286)+1>COUNT(Tab_IID_FinanzPer16[II-D_Zeile]),\"\",INDEX(F:F,SMALL(Tab_IID_FinanzPer16[II-D_Zeile],1+ROW(F295)-ROW($F$286))))","v":"BVer2 - Spieltagsumsatz steigt"}]
[110,null,{"$f":"B_II_Verw_Konzept!N14","v":"Transfererlöse steigen"},{"$f":"B_II_Verw_Konzept!O14","v":"-"},null,{"$f":"Tab_IID_FinanzPer16[[#This Row],[II-D_Funktionen]]","v":"Transfererlöse steigen"},296,{"$f":"IF(ROW(C296)-ROW(C$286)+1>COUNT(Tab_IID_FinanzPer16[II-D_Zeile]),\"\",INDEX(F:F,SMALL(Tab_IID_FinanzPer16[II-D_Zeile],1+ROW(F296)-ROW($F$286))))","v":"Transfererlöse steigen"}]
[111,null,{"$f":"B_II_Verw_Konzept!N15","v":"Verkaufserlöse"},{"$f":"B_II_Verw_Konzept!O15","v":"-"},null,{"$f":"Tab_IID_FinanzPer16[[#This Row],[II-D_Funktionen]]","v":"Verkaufserlöse"},297,{"$f":"IF(ROW(C297)-ROW(C$286)+1>COUNT(Tab_IID_FinanzPer16[II-D_Zeile]),\"\",INDEX(F:F,SMALL(Tab_IID_FinanzPer16[II-D_Zeile],1+ROW(F297)-ROW($F$286))))","v":"Verkaufserlöse"}]
[112,null,{"$f":"B_II_Verw_Konzept!N16","v":"Leihgebühren"},{"$f":"B_II_Verw_Konzept!O16","v":"-"},null,{"$f":"Tab_IID_FinanzPer16[[#This Row],[II-D_Funktionen]]","v":"Leihgebühren"},298,{"$f":"IF(ROW(C298)-ROW(C$286)+1>COUNT(Tab_IID_FinanzPer16[II-D_Zeile]),\"\",INDEX(F:F,SMALL(Tab_IID_FinanzPer16[II-D_Zeile],1+ROW(F298)-ROW($F$286))))","v":"Leihgebühren"}]
[113,null,{"$f":"B_II_Verw_Konzept!N17","v":"Vermietungen"},{"$f":"B_II_Verw_Konzept!O17","v":"-"},null,{"$f":"Tab_IID_FinanzPer16[[#This Row],[II-D_Funktionen]]","v":"Vermietungen"},299,{"$f":"IF(ROW(C299)-ROW(C$286)+1>COUNT(Tab_IID_FinanzPer16[II-D_Zeile]),\"\",INDEX(F:F,SMALL(Tab_IID_FinanzPer16[II-D_Zeile],1+ROW(F299)-ROW($F$286))))","v":"Vermietungen"}]
[114,null,{"$f":"B_II_Verw_Konzept!N18","v":"Spieltagssponsoring"},{"$f":"B_II_Verw_Konzept!O18","v":"-"},null,{"$f":"Tab_IID_FinanzPer16[[#This Row],[II-D_Funktionen]]","v":"Spieltagssponsoring"},300,{"$f":"IF(ROW(C300)-ROW(C$286)+1>COUNT(Tab_IID_FinanzPer16[II-D_Zeile]),\"\",INDEX(F:F,SMALL(Tab_IID_FinanzPer16[II-D_Zeile],1+ROW(F300)-ROW($F$286))))","v":"Spieltagssponsoring"}]
[115,null,{"$f":"B_II_Verw_Konzept!N19","v":"Matchballsponsoring"},{"$f":"B_II_Verw_Konzept!O19","v":"-"},null,{"$f":"Tab_IID_FinanzPer16[[#This Row],[II-D_Funktionen]]","v":"Matchballsponsoring"},301,{"$f":"IF(ROW(C301)-ROW(C$286)+1>COUNT(Tab_IID_FinanzPer16[II-D_Zeile]),\"\",INDEX(F:F,SMALL(Tab_IID_FinanzPer16[II-D_Zeile],1+ROW(F301)-ROW($F$286))))","v":"Matchballsponsoring"}]
[116,null,{"$f":"B_II_Verw_Konzept!N20","v":"Werbedurchsagen"},{"$f":"B_II_Verw_Konzept!O20","v":"-"},null,{"$f":"Tab_IID_FinanzPer16[[#This Row],[II-D_Funktionen]]","v":"Werbedurchsagen"},302,{"$f":"IF(ROW(C302)-ROW(C$286)+1>COUNT(Tab_IID_FinanzPer16[II-D_Zeile]),\"\",INDEX(F:F,SMALL(Tab_IID_FinanzPer16[II-D_Zeile],1+ROW(F302)-ROW($F$286))))","v":"Werbedurchsagen"}]
[117,null,{"$f":"B_II_Verw_Konzept!N21","v":"Fanshop"},{"$f":"B_II_Verw_Konzept!O21","v":"-"},null,{"$f":"Tab_IID_FinanzPer16[[#This Row],[II-D_Funktionen]]","v":"Fanshop"},303,{"$f":"IF(ROW(C303)-ROW(C$286)+1>COUNT(Tab_IID_FinanzPer16[II-D_Zeile]),\"\",INDEX(F:F,SMALL(Tab_IID_FinanzPer16[II-D_Zeile],1+ROW(F303)-ROW($F$286))))","v":"Fanshop"}]
[118,null,{"$f":"B_II_Verw_Konzept!P13","v":"Höhere Gewinne bei Veranstaltungen"},{"$f":"B_II_Verw_Konzept!Q13","v":"-"},null,{"$f":"Tab_IID_FinanzPer16[[#This Row],[II-D_Funktionen]]","v":"Höhere Gewinne bei Veranstaltungen"},304,{"$f":"IF(ROW(C304)-ROW(C$286)+1>COUNT(Tab_IID_FinanzPer16[II-D_Zeile]),\"\",INDEX(F:F,SMALL(Tab_IID_FinanzPer16[II-D_Zeile],1+ROW(F304)-ROW($F$286))))","v":"Höhere Gewinne bei Veranstaltungen"}]
[119,null,{"$f":"B_II_Verw_Konzept!P14","v":"Sommerfeste"},{"$f":"B_II_Verw_Konzept!Q14","v":"-"},null,{"$f":"Tab_IID_FinanzPer16[[#This Row],[II-D_Funktionen]]","v":"Sommerfeste"},305,{"$f":"IF(ROW(C305)-ROW(C$286)+1>COUNT(Tab_IID_FinanzPer16[II-D_Zeile]),\"\",INDEX(F:F,SMALL(Tab_IID_FinanzPer16[II-D_Zeile],1+ROW(F305)-ROW($F$286))))","v":"Sommerfeste"}]
[120,null,{"$f":"B_II_Verw_Konzept!P15","v":"Winterveranstaltungen"},{"$f":"B_II_Verw_Konzept!Q15","v":"-"},null,{"$f":"Tab_IID_FinanzPer16[[#This Row],[II-D_Funktionen]]","v":"Winterveranstaltungen"},306,{"$f":"IF(ROW(C306)-ROW(C$286)+1>COUNT(Tab_IID_FinanzPer16[II-D_Zeile]),\"\",INDEX(F:F,SMALL(Tab_IID_FinanzPer16[II-D_Zeile],1+ROW(F306)-ROW($F$286))))","v":"Winterveranstaltungen"}]
[121,null,{"$f":"B_II_Verw_Konzept!P16","v":"Flohmarkt"},{"$f":"B_II_Verw_Konzept!Q16","v":"-"},null,{"$f":"Tab_IID_FinanzPer16[[#This Row],[II-D_Funktionen]]","v":"Flohmarkt"},307,{"$f":"IF(ROW(C307)-ROW(C$286)+1>COUNT(Tab_IID_FinanzPer16[II-D_Zeile]),\"\",INDEX(F:F,SMALL(Tab_IID_FinanzPer16[II-D_Zeile],1+ROW(F307)-ROW($F$286))))","v":"Flohmarkt"}]
[122,null,{"$f":"B_II_Verw_Konzept!P17","v":"Weihnachtsmarkt"},{"$f":"B_II_Verw_Konzept!Q17","v":"-"},null,{"$f":"Tab_IID_FinanzPer16[[#This Row],[II-D_Funktionen]]","v":"Weihnachtsmarkt"},308,{"$f":"IF(ROW(C308)-ROW(C$286)+1>COUNT(Tab_IID_FinanzPer16[II-D_Zeile]),\"\",INDEX(F:F,SMALL(Tab_IID_FinanzPer16[II-D_Zeile],1+ROW(F308)-ROW($F$286))))","v":"Weihnachtsmarkt"}]
[123,null,{"$f":"B_II_Verw_Konzept!P18","v":"Eisstockturnier"},{"$f":"B_II_Verw_Konzept!Q18","v":"-"},null,{"$f":"Tab_IID_FinanzPer16[[#This Row],[II-D_Funktionen]]","v":"Eisstockturnier"},309,{"$f":"IF(ROW(C309)-ROW(C$286)+1>COUNT(Tab_IID_FinanzPer16[II-D_Zeile]),\"\",INDEX(F:F,SMALL(Tab_IID_FinanzPer16[II-D_Zeile],1+ROW(F309)-ROW($F$286))))","v":"Eisstockturnier"}]
[124,null,{"$f":"B_II_Verw_Konzept!P19","v":"Faschingsumzug"},{"$f":"B_II_Verw_Konzept!Q19","v":"-"},null,{"$f":"Tab_IID_FinanzPer16[[#This Row],[II-D_Funktionen]]","v":"Faschingsumzug"},310,{"$f":"IF(ROW(C310)-ROW(C$286)+1>COUNT(Tab_IID_FinanzPer16[II-D_Zeile]),\"\",INDEX(F:F,SMALL(Tab_IID_FinanzPer16[II-D_Zeile],1+ROW(F310)-ROW($F$286))))","v":"Faschingsumzug"}]
[125,null,{"$f":"B_II_Verw_Konzept!P20","v":"Stadtfest"},{"$f":"B_II_Verw_Konzept!Q20","v":"-"},null,{"$f":"Tab_IID_FinanzPer16[[#This Row],[II-D_Funktionen]]","v":"Stadtfest"},311,{"$f":"IF(ROW(C311)-ROW(C$286)+1>COUNT(Tab_IID_FinanzPer16[II-D_Zeile]),\"\",INDEX(F:F,SMALL(Tab_IID_FinanzPer16[II-D_Zeile],1+ROW(F311)-ROW($F$286))))","v":"Stadtfest"}]
[126,null,{"$f":"B_II_Verw_Konzept!P21","v":"Veranstaltung_9"},{"$f":"B_II_Verw_Konzept!Q21","v":"-"},null,{"$f":"Tab_IID_FinanzPer16[[#This Row],[II-D_Funktionen]]","v":"Veranstaltung_9"},312,{"$f":"IF(ROW(C312)-ROW(C$286)+1>COUNT(Tab_IID_FinanzPer16[II-D_Zeile]),\"\",INDEX(F:F,SMALL(Tab_IID_FinanzPer16[II-D_Zeile],1+ROW(F312)-ROW($F$286))))","v":"Veranstaltung_9"}]
[127,null,{"$f":"B_II_Verw_Konzept!R13","v":"Buffet/Kantine"},{"$f":"B_II_Verw_Konzept!S13","v":"-"},null,{"$f":"Tab_IID_FinanzPer16[[#This Row],[II-D_Funktionen]]","v":"Buffet/Kantine"},313,{"$f":"IF(ROW(C313)-ROW(C$286)+1>COUNT(Tab_IID_FinanzPer16[II-D_Zeile]),\"\",INDEX(F:F,SMALL(Tab_IID_FinanzPer16[II-D_Zeile],1+ROW(F313)-ROW($F$286))))","v":"Buffet/Kantine"}]
[128,null,{"$f":"B_II_Verw_Konzept!R14","v":"Tribüne"},{"$f":"B_II_Verw_Konzept!S14","v":"-"},null,{"$f":"Tab_IID_FinanzPer16[[#This Row],[II-D_Funktionen]]","v":"Tribüne"},314,{"$f":"IF(ROW(C314)-ROW(C$286)+1>COUNT(Tab_IID_FinanzPer16[II-D_Zeile]),\"\",INDEX(F:F,SMALL(Tab_IID_FinanzPer16[II-D_Zeile],1+ROW(F314)-ROW($F$286))))","v":"Tribüne"}]
[129,null,{"$f":"B_II_Verw_Konzept!R15","v":"Hütten"},{"$f":"B_II_Verw_Konzept!S15","v":"-"},null,{"$f":"Tab_IID_FinanzPer16[[#This Row],[II-D_Funktionen]]","v":"Hütten"},315,{"$f":"IF(ROW(C315)-ROW(C$286)+1>COUNT(Tab_IID_FinanzPer16[II-D_Zeile]),\"\",INDEX(F:F,SMALL(Tab_IID_FinanzPer16[II-D_Zeile],1+ROW(F315)-ROW($F$286))))","v":"Hütten"}]
[130,null,{"$f":"B_II_Verw_Konzept!R16","v":"Nachwuchshütte"},{"$f":"B_II_Verw_Konzept!S16","v":"-"},null,{"$f":"Tab_IID_FinanzPer16[[#This Row],[II-D_Funktionen]]","v":"Nachwuchshütte"},316,{"$f":"IF(ROW(C316)-ROW(C$286)+1>COUNT(Tab_IID_FinanzPer16[II-D_Zeile]),\"\",INDEX(F:F,SMALL(Tab_IID_FinanzPer16[II-D_Zeile],1+ROW(F316)-ROW($F$286))))","v":"Nachwuchshütte"}]
[131,null,{"$f":"B_II_Verw_Konzept!R17","v":"Sonstige"},{"$f":"B_II_Verw_Konzept!S17","v":"-"},null,{"$f":"Tab_IID_FinanzPer16[[#This Row],[II-D_Funktionen]]","v":"Sonstige"},317,{"$f":"IF(ROW(C317)-ROW(C$286)+1>COUNT(Tab_IID_FinanzPer16[II-D_Zeile]),\"\",INDEX(F:F,SMALL(Tab_IID_FinanzPer16[II-D_Zeile],1+ROW(F317)-ROW($F$286))))","v":"Sonstige"}]
[132,null,{"$f":"B_II_Verw_Konzept!R18","v":"Gastronomie_6"},{"$f":"B_II_Verw_Konzept!S18","v":"-"},null,{"$f":"Tab_IID_FinanzPer16[[#This Row],[II-D_Funktionen]]","v":"Gastronomie_6"},318,{"$f":"IF(ROW(C318)-ROW(C$286)+1>COUNT(Tab_IID_FinanzPer16[II-D_Zeile]),\"\",INDEX(F:F,SMALL(Tab_IID_FinanzPer16[II-D_Zeile],1+ROW(F318)-ROW($F$286))))","v":"Gastronomie_6"}]
[133,null,{"$f":"B_II_Verw_Konzept!R19","v":"Gastronomie_7"},{"$f":"B_II_Verw_Konzept!S19","v":"-"},null,{"$f":"Tab_IID_FinanzPer16[[#This Row],[II-D_Funktionen]]","v":"Gastronomie_7"},319,{"$f":"IF(ROW(C319)-ROW(C$286)+1>COUNT(Tab_IID_FinanzPer16[II-D_Zeile]),\"\",INDEX(F:F,SMALL(Tab_IID_FinanzPer16[II-D_Zeile],1+ROW(F319)-ROW($F$286))))","v":"Gastronomie_7"}]
[134,null,{"$f":"B_II_Verw_Konzept!R20","v":"Gastronomie_8"},{"$f":"B_II_Verw_Konzept!S20","v":"-"},null,{"$f":"Tab_IID_FinanzPer16[[#This Row],[II-D_Funktionen]]","v":"Gastronomie_8"},320,{"$f":"IF(ROW(C320)-ROW(C$286)+1>COUNT(Tab_IID_FinanzPer16[II-D_Zeile]),\"\",INDEX(F:F,SMALL(Tab_IID_FinanzPer16[II-D_Zeile],1+ROW(F320)-ROW($F$286))))","v":"Gastronomie_8"}]
[135,null,{"$f":"B_II_Verw_Konzept!R21","v":"Gastronomie_9"},{"$f":"B_II_Verw_Konzept!S21","v":"-"},null,{"$f":"Tab_IID_FinanzPer16[[#This Row],[II-D_Funktionen]]","v":"Gastronomie_9"},321,{"$f":"IF(ROW(C321)-ROW(C$286)+1>COUNT(Tab_IID_FinanzPer16[II-D_Zeile]),\"\",INDEX(F:F,SMALL(Tab_IID_FinanzPer16[II-D_Zeile],1+ROW(F321)-ROW($F$286))))","v":"Gastronomie_9"}]
[]
["L_Nr.","III. Sportkonzept","III-E_Funktionen","III-E_Werte","III-E_100%","III-E_Funktion","III-E_Zeile","III-E_noch möglich"]
[136,{"$f":"B_III_Sport_Konzept!$B$5","v":"E. Visionsperspektive"},{"$f":"B_III_Sport_Konzept!L2","v":"Vereinsvision"},{"$f":"B_III_Sport_Konzept!M2","v":"-"},null,{"$f":"Tab_IIIE_VisionsPer17[[#This Row],[III-E_Funktionen]]","v":"Vereinsvision"},{"$f":"IF(COUNTIF($C$78:$C$89,F324)>=1,\"\",ROW())","v":324},{"$f":"IF(ROW(C324)-ROW(C$324)+1>COUNT(Tab_IIIE_VisionsPer17[III-E_Zeile]),\"\",INDEX(F:F,SMALL(Tab_IIIE_VisionsPer17[III-E_Zeile],1+ROW(F324)-ROW($F$324))))","v":"Vereinsvision"}]
[137,null,{"$f":"B_III_Sport_Konzept!L3","v":"Sportliche Vereinsvisionen"},{"$f":"B_III_Sport_Konzept!M3","v":"-"},null,{"$f":"Tab_IIIE_VisionsPer17[[#This Row],[III-E_Funktionen]]","v":"Sportliche Vereinsvisionen"},{"$f":"IF(COUNTIF($C$78:$C$89,F325)>=1,\"\",ROW())","v":325},{"$f":"IF(ROW(C325)-ROW(C$324)+1>COUNT(Tab_IIIE_VisionsPer17[III-E_Zeile]),\"\",INDEX(F:F,SMALL(Tab_IIIE_VisionsPer17[III-E_Zeile],1+ROW(F325)-ROW($F$324))))","v":"Sportliche Vereinsvisionen"}]
[138,null,{"$f":"B_III_Sport_Konzept!L4","v":"Tugenden/Motivation"},{"$f":"B_III_Sport_Konzept!M4","v":"-"},null,{"$f":"Tab_IIIE_VisionsPer17[[#This Row],[III-E_Funktionen]]","v":"Tugenden/Motivation"},326,{"$f":"IF(ROW(C326)-ROW(C$324)+1>COUNT(Tab_IIIE_VisionsPer17[III-E_Zeile]),\"\",INDEX(F:F,SMALL(Tab_IIIE_VisionsPer17[III-E_Zeile],1+ROW(F326)-ROW($F$324))))","v":"Tugenden/Motivation"}]
[139,null,{"$f":"B_III_Sport_Konzept!L5","v":"Spielsystemvision"},{"$f":"B_III_Sport_Konzept!M5","v":"-"},null,{"$f":"Tab_IIIE_VisionsPer17[[#This Row],[III-E_Funktionen]]","v":"Spielsystemvision"},327,{"$f":"IF(ROW(C327)-ROW(C$324)+1>COUNT(Tab_IIIE_VisionsPer17[III-E_Zeile]),\"\",INDEX(F:F,SMALL(Tab_IIIE_VisionsPer17[III-E_Zeile],1+ROW(F327)-ROW($F$324))))","v":"Spielsystemvision"}]
[140,null,{"$f":"B_III_Sport_Konzept!L6","v":"Scoutingvision"},{"$f":"B_III_Sport_Konzept!M6","v":"-"},null,{"$f":"Tab_IIIE_VisionsPer17[[#This Row],[III-E_Funktionen]]","v":"Scoutingvision"},328,{"$f":"IF(ROW(C328)-ROW(C$324)+1>COUNT(Tab_IIIE_VisionsPer17[III-E_Zeile]),\"\",INDEX(F:F,SMALL(Tab_IIIE_VisionsPer17[III-E_Zeile],1+ROW(F328)-ROW($F$324))))","v":"Scoutingvision"}]
[141,null,{"$f":"B_III_Sport_Konzept!L7","v":"Analysevision"},{"$f":"B_III_Sport_Konzept!M7","v":"-"},null,{"$f":"Tab_IIIE_VisionsPer17[[#This Row],[III-E_Funktionen]]","v":"Analysevision"},329,{"$f":"IF(ROW(C329)-ROW(C$324)+1>COUNT(Tab_IIIE_VisionsPer17[III-E_Zeile]),\"\",INDEX(F:F,SMALL(Tab_IIIE_VisionsPer17[III-E_Zeile],1+ROW(F329)-ROW($F$324))))","v":"Analysevision"}]
[142,null,{"$f":"B_III_Sport_Konzept!L8","v":"Therapievisionen"},{"$f":"B_III_Sport_Konzept!M8","v":"-"},null,{"$f":"Tab_IIIE_VisionsPer17[[#This Row],[III-E_Funktionen]]","v":"Therapievisionen"},330,{"$f":"IF(ROW(C330)-ROW(C$324)+1>COUNT(Tab_IIIE_VisionsPer17[III-E_Zeile]),\"\",INDEX(F:F,SMALL(Tab_IIIE_VisionsPer17[III-E_Zeile],1+ROW(F330)-ROW($F$324))))","v":"Therapievisionen"}]
[143,null,{"$f":"B_III_Sport_Konzept!L9","v":"Medizinische Abteilung"},{"$f":"B_III_Sport_Konzept!M9","v":"-"},null,{"$f":"Tab_IIIE_VisionsPer17[[#This Row],[III-E_Funktionen]]","v":"Medizinische Abteilung"},331,{"$f":"IF(ROW(C331)-ROW(C$324)+1>COUNT(Tab_IIIE_VisionsPer17[III-E_Zeile]),\"\",INDEX(F:F,SMALL(Tab_IIIE_VisionsPer17[III-E_Zeile],1+ROW(F331)-ROW($F$324))))","v":"Medizinische Abteilung"}]
[144,null,{"$f":"B_III_Sport_Konzept!L10","v":"Mentaltrainer"},{"$f":"B_III_Sport_Konzept!M10","v":"-"},null,{"$f":"Tab_IIIE_VisionsPer17[[#This Row],[III-E_Funktionen]]","v":"Mentaltrainer"},332,{"$f":"IF(ROW(C332)-ROW(C$324)+1>COUNT(Tab_IIIE_VisionsPer17[III-E_Zeile]),\"\",INDEX(F:F,SMALL(Tab_IIIE_VisionsPer17[III-E_Zeile],1+ROW(F332)-ROW($F$324))))","v":"Mentaltrainer"}]
[145,null,{"$f":"B_III_Sport_Konzept!N2","v":"Tugenden/Motivation"},{"$f":"B_III_Sport_Konzept!O2","v":"-"},null,{"$f":"Tab_IIIE_VisionsPer17[[#This Row],[III-E_Funktionen]]","v":"Tugenden/Motivation"},333,{"$f":"IF(ROW(C333)-ROW(C$324)+1>COUNT(Tab_IIIE_VisionsPer17[III-E_Zeile]),\"\",INDEX(F:F,SMALL(Tab_IIIE_VisionsPer17[III-E_Zeile],1+ROW(F333)-ROW($F$324))))","v":"Tugenden/Motivation"}]
[146,null,{"$f":"B_III_Sport_Konzept!N3","v":"Spielsystemvision"},{"$f":"B_III_Sport_Konzept!O3","v":"-"},null,{"$f":"Tab_IIIE_VisionsPer17[[#This Row],[III-E_Funktionen]]","v":"Spielsystemvision"},334,{"$f":"IF(ROW(C334)-ROW(C$324)+1>COUNT(Tab_IIIE_VisionsPer17[III-E_Zeile]),\"\",INDEX(F:F,SMALL(Tab_IIIE_VisionsPer17[III-E_Zeile],1+ROW(F334)-ROW($F$324))))","v":"Spielsystemvision"}]
[147,null,{"$f":"B_III_Sport_Konzept!N4","v":"Spielvision"},{"$f":"B_III_Sport_Konzept!O4","v":"-"},null,{"$f":"Tab_IIIE_VisionsPer17[[#This Row],[III-E_Funktionen]]","v":"Spielvision"},335,{"$f":"IF(ROW(C335)-ROW(C$324)+1>COUNT(Tab_IIIE_VisionsPer17[III-E_Zeile]),\"\",INDEX(F:F,SMALL(Tab_IIIE_VisionsPer17[III-E_Zeile],1+ROW(F335)-ROW($F$324))))","v":"Spielvision"}]
[148,null,{"$f":"B_III_Sport_Konzept!N5","v":"Ausbildungsvision"},{"$f":"B_III_Sport_Konzept!O5","v":"-"},null,{"$f":"Tab_IIIE_VisionsPer17[[#This Row],[III-E_Funktionen]]","v":"Ausbildungsvision"},336,{"$f":"IF(ROW(C336)-ROW(C$324)+1>COUNT(Tab_IIIE_VisionsPer17[III-E_Zeile]),\"\",INDEX(F:F,SMALL(Tab_IIIE_VisionsPer17[III-E_Zeile],1+ROW(F336)-ROW($F$324))))","v":"Ausbildungsvision"}]
[149,null,{"$f":"B_III_Sport_Konzept!N6","v":"Trainingsvision"},{"$f":"B_III_Sport_Konzept!O6","v":"-"},null,{"$f":"Tab_IIIE_VisionsPer17[[#This Row],[III-E_Funktionen]]","v":"Trainingsvision"},337,{"$f":"IF(ROW(C337)-ROW(C$324)+1>COUNT(Tab_IIIE_VisionsPer17[III-E_Zeile]),\"\",INDEX(F:F,SMALL(Tab_IIIE_VisionsPer17[III-E_Zeile],1+ROW(F337)-ROW($F$324))))","v":"Trainingsvision"}]
[150,null,{"$f":"B_III_Sport_Konzept!N7","v":"Scoutingvision"},{"$f":"B_III_Sport_Konzept!O7","v":"-"},null,{"$f":"Tab_IIIE_VisionsPer17[[#This Row],[III-E_Funktionen]]","v":"Scoutingvision"},338,{"$f":"IF(ROW(C338)-ROW(C$324)+1>COUNT(Tab_IIIE_VisionsPer17[III-E_Zeile]),\"\",INDEX(F:F,SMALL(Tab_IIIE_VisionsPer17[III-E_Zeile],1+ROW(F338)-ROW($F$324))))","v":"Scoutingvision"}]
[151,null,{"$f":"B_III_Sport_Konzept!N8","v":"Analysevision"},{"$f":"B_III_Sport_Konzept!O8","v":"-"},null,{"$f":"Tab_IIIE_VisionsPer17[[#This Row],[III-E_Funktionen]]","v":"Analysevision"},339,{"$f":"IF(ROW(C339)-ROW(C$324)+1>COUNT(Tab_IIIE_VisionsPer17[III-E_Zeile]),\"\",INDEX(F:F,SMALL(Tab_IIIE_VisionsPer17[III-E_Zeile],1+ROW(F339)-ROW($F$324))))","v":"Analysevision"}]
[152,null,{"$f":"B_III_Sport_Konzept!N9","v":"Spielsystemvision_8"},{"$f":"B_III_Sport_Konzept!O9","v":"-"},null,{"$f":"Tab_IIIE_VisionsPer17[[#This Row],[III-E_Funktionen]]","v":"Spielsystemvision_8"},340,{"$f":"IF(ROW(C340)-ROW(C$324)+1>COUNT(Tab_IIIE_VisionsPer17[III-E_Zeile]),\"\",INDEX(F:F,SMALL(Tab_IIIE_VisionsPer17[III-E_Zeile],1+ROW(F340)-ROW($F$324))))","v":"Spielsystemvision_8"}]
[153,null,{"$f":"B_III_Sport_Konzept!N10","v":"Spielsystemvision_9"},{"$f":"B_III_Sport_Konzept!O10","v":"-"},null,{"$f":"Tab_IIIE_VisionsPer17[[#This Row],[III-E_Funktionen]]","v":"Spielsystemvision_9"},341,{"$f":"IF(ROW(C341)-ROW(C$324)+1>COUNT(Tab_IIIE_VisionsPer17[III-E_Zeile]),\"\",INDEX(F:F,SMALL(Tab_IIIE_VisionsPer17[III-E_Zeile],1+ROW(F341)-ROW($F$324))))","v":"Spielsystemvision_9"}]
[154,null,{"$f":"B_III_Sport_Konzept!P2","v":"Tugenden/Motivation"},{"$f":"B_III_Sport_Konzept!Q2","v":"-"},null,{"$f":"Tab_IIIE_VisionsPer17[[#This Row],[III-E_Funktionen]]","v":"Tugenden/Motivation"},342,{"$f":"IF(ROW(C342)-ROW(C$324)+1>COUNT(Tab_IIIE_VisionsPer17[III-E_Zeile]),\"\",INDEX(F:F,SMALL(Tab_IIIE_VisionsPer17[III-E_Zeile],1+ROW(F342)-ROW($F$324))))","v":"Tugenden/Motivation"}]
[155,null,{"$f":"B_III_Sport_Konzept!P3","v":"Spielvision"},{"$f":"B_III_Sport_Konzept!Q3","v":"-"},null,{"$f":"Tab_IIIE_VisionsPer17[[#This Row],[III-E_Funktionen]]","v":"Spielvision"},343,{"$f":"IF(ROW(C343)-ROW(C$324)+1>COUNT(Tab_IIIE_VisionsPer17[III-E_Zeile]),\"\",INDEX(F:F,SMALL(Tab_IIIE_VisionsPer17[III-E_Zeile],1+ROW(F343)-ROW($F$324))))","v":"Spielvision"}]
[156,null,{"$f":"B_III_Sport_Konzept!P4","v":"Ausbildungsvision"},{"$f":"B_III_Sport_Konzept!Q4","v":"-"},null,{"$f":"Tab_IIIE_VisionsPer17[[#This Row],[III-E_Funktionen]]","v":"Ausbildungsvision"},344,{"$f":"IF(ROW(C344)-ROW(C$324)+1>COUNT(Tab_IIIE_VisionsPer17[III-E_Zeile]),\"\",INDEX(F:F,SMALL(Tab_IIIE_VisionsPer17[III-E_Zeile],1+ROW(F344)-ROW($F$324))))","v":"Ausbildungsvision"}]
[157,null,{"$f":"B_III_Sport_Konzept!P5","v":"Trainingsvision"},{"$f":"B_III_Sport_Konzept!Q5","v":"-"},null,{"$f":"Tab_IIIE_VisionsPer17[[#This Row],[III-E_Funktionen]]","v":"Trainingsvision"},345,{"$f":"IF(ROW(C345)-ROW(C$324)+1>COUNT(Tab_IIIE_VisionsPer17[III-E_Zeile]),\"\",INDEX(F:F,SMALL(Tab_IIIE_VisionsPer17[III-E_Zeile],1+ROW(F345)-ROW($F$324))))","v":"Trainingsvision"}]
[158,null,{"$f":"B_III_Sport_Konzept!P6","v":"Scoutingvision"},{"$f":"B_III_Sport_Konzept!Q6","v":"-"},null,{"$f":"Tab_IIIE_VisionsPer17[[#This Row],[III-E_Funktionen]]","v":"Scoutingvision"},346,{"$f":"IF(ROW(C346)-ROW(C$324)+1>COUNT(Tab_IIIE_VisionsPer17[III-E_Zeile]),\"\",INDEX(F:F,SMALL(Tab_IIIE_VisionsPer17[III-E_Zeile],1+ROW(F346)-ROW($F$324))))","v":"Scoutingvision"}]
[159,null,{"$f":"B_III_Sport_Konzept!P7","v":"Analysevision"},{"$f":"B_III_Sport_Konzept!Q7","v":"-"},null,{"$f":"Tab_IIIE_VisionsPer17[[#This Row],[III-E_Funktionen]]","v":"Analysevision"},347,{"$f":"IF(ROW(C347)-ROW(C$324)+1>COUNT(Tab_IIIE_VisionsPer17[III-E_Zeile]),\"\",INDEX(F:F,SMALL(Tab_IIIE_VisionsPer17[III-E_Zeile],1+ROW(F347)-ROW($F$324))))","v":"Analysevision"}]
[160,null,{"$f":"B_III_Sport_Konzept!P8","v":"Spieltaktische Visionen"},{"$f":"B_III_Sport_Konzept!Q8","v":"-"},null,{"$f":"Tab_IIIE_VisionsPer17[[#This Row],[III-E_Funktionen]]","v":"Spieltaktische Visionen"},348,{"$f":"IF(ROW(C348)-ROW(C$324)+1>COUNT(Tab_IIIE_VisionsPer17[III-E_Zeile]),\"\",INDEX(F:F,SMALL(Tab_IIIE_VisionsPer17[III-E_Zeile],1+ROW(F348)-ROW($F$324))))","v":"Spieltaktische Visionen"}]
[161,null,{"$f":"B_III_Sport_Konzept!P9","v":"Spielphasen Visionen"},{"$f":"B_III_Sport_Konzept!Q9","v":"-"},null,{"$f":"Tab_IIIE_VisionsPer17[[#This Row],[III-E_Funktionen]]","v":"Spielphasen Visionen"},349,{"$f":"IF(ROW(C349)-ROW(C$324)+1>COUNT(Tab_IIIE_VisionsPer17[III-E_Zeile]),\"\",INDEX(F:F,SMALL(Tab_IIIE_VisionsPer17[III-E_Zeile],1+ROW(F349)-ROW($F$324))))","v":"Spielphasen Visionen"}]
[162,null,{"$f":"B_III_Sport_Konzept!P10","v":"Sport-Spielvisionen KM_9"},{"$f":"B_III_Sport_Konzept!Q10","v":"-"},null,{"$f":"Tab_IIIE_VisionsPer17[[#This Row],[III-E_Funktionen]]","v":"Sport-Spielvisionen KM_9"},350,{"$f":"IF(ROW(C350)-ROW(C$324)+1>COUNT(Tab_IIIE_VisionsPer17[III-E_Zeile]),\"\",INDEX(F:F,SMALL(Tab_IIIE_VisionsPer17[III-E_Zeile],1+ROW(F350)-ROW($F$324))))","v":"Sport-Spielvisionen KM_9"}]
[163,null,{"$f":"B_III_Sport_Konzept!R2","v":"Tugenden/Motivation"},{"$f":"B_III_Sport_Konzept!S2","v":"-"},null,{"$f":"Tab_IIIE_VisionsPer17[[#This Row],[III-E_Funktionen]]","v":"Tugenden/Motivation"},351,{"$f":"IF(ROW(C351)-ROW(C$324)+1>COUNT(Tab_IIIE_VisionsPer17[III-E_Zeile]),\"\",INDEX(F:F,SMALL(Tab_IIIE_VisionsPer17[III-E_Zeile],1+ROW(F351)-ROW($F$324))))","v":"Tugenden/Motivation"}]
[164,null,{"$f":"B_III_Sport_Konzept!R3","v":"Spielvision"},{"$f":"B_III_Sport_Konzept!S3","v":"-"},null,{"$f":"Tab_IIIE_VisionsPer17[[#This Row],[III-E_Funktionen]]","v":"Spielvision"},352,{"$f":"IF(ROW(C352)-ROW(C$324)+1>COUNT(Tab_IIIE_VisionsPer17[III-E_Zeile]),\"\",INDEX(F:F,SMALL(Tab_IIIE_VisionsPer17[III-E_Zeile],1+ROW(F352)-ROW($F$324))))","v":"Spielvision"}]
[165,null,{"$f":"B_III_Sport_Konzept!R4","v":"Ausbildungsvision"},{"$f":"B_III_Sport_Konzept!S4","v":"-"},null,{"$f":"Tab_IIIE_VisionsPer17[[#This Row],[III-E_Funktionen]]","v":"Ausbildungsvision"},353,{"$f":"IF(ROW(C353)-ROW(C$324)+1>COUNT(Tab_IIIE_VisionsPer17[III-E_Zeile]),\"\",INDEX(F:F,SMALL(Tab_IIIE_VisionsPer17[III-E_Zeile],1+ROW(F353)-ROW($F$324))))","v":"Ausbildungsvision"}]
[166,null,{"$f":"B_III_Sport_Konzept!R5","v":"Trainingsvision"},{"$f":"B_III_Sport_Konzept!S5","v":"-"},null,{"$f":"Tab_IIIE_VisionsPer17[[#This Row],[III-E_Funktionen]]","v":"Trainingsvision"},354,{"$f":"IF(ROW(C354)-ROW(C$324)+1>COUNT(Tab_IIIE_VisionsPer17[III-E_Zeile]),\"\",INDEX(F:F,SMALL(Tab_IIIE_VisionsPer17[III-E_Zeile],1+ROW(F354)-ROW($F$324))))","v":"Trainingsvision"}]
[167,null,{"$f":"B_III_Sport_Konzept!R6","v":"Scoutingvision"},{"$f":"B_III_Sport_Konzept!S6","v":"-"},null,{"$f":"Tab_IIIE_VisionsPer17[[#This Row],[III-E_Funktionen]]","v":"Scoutingvision"},355,{"$f":"IF(ROW(C355)-ROW(C$324)+1>COUNT(Tab_IIIE_VisionsPer17[III-E_Zeile]),\"\",INDEX(F:F,SMALL(Tab_IIIE_VisionsPer17[III-E_Zeile],1+ROW(F355)-ROW($F$324))))","v":"Scoutingvision"}]
[168,null,{"$f":"B_III_Sport_Konzept!R7","v":"Analysevision"},{"$f":"B_III_Sport_Konzept!S7","v":"-"},null,{"$f":"Tab_IIIE_VisionsPer17[[#This Row],[III-E_Funktionen]]","v":"Analysevision"},356,{"$f":"IF(ROW(C356)-ROW(C$324)+1>COUNT(Tab_IIIE_VisionsPer17[III-E_Zeile]),\"\",INDEX(F:F,SMALL(Tab_IIIE_VisionsPer17[III-E_Zeile],1+ROW(F356)-ROW($F$324))))","v":"Analysevision"}]
[169,null,{"$f":"B_III_Sport_Konzept!R8","v":"Spieltaktische Visionen"},{"$f":"B_III_Sport_Konzept!S8","v":"-"},null,{"$f":"Tab_IIIE_VisionsPer17[[#This Row],[III-E_Funktionen]]","v":"Spieltaktische Visionen"},357,{"$f":"IF(ROW(C357)-ROW(C$324)+1>COUNT(Tab_IIIE_VisionsPer17[III-E_Zeile]),\"\",INDEX(F:F,SMALL(Tab_IIIE_VisionsPer17[III-E_Zeile],1+ROW(F357)-ROW($F$324))))","v":"Spieltaktische Visionen"}]
[170,null,{"$f":"B_III_Sport_Konzept!R9","v":"Spielphasen Visionen"},{"$f":"B_III_Sport_Konzept!S9","v":"-"},null,{"$f":"Tab_IIIE_VisionsPer17[[#This Row],[III-E_Funktionen]]","v":"Spielphasen Visionen"},358,{"$f":"IF(ROW(C358)-ROW(C$324)+1>COUNT(Tab_IIIE_VisionsPer17[III-E_Zeile]),\"\",INDEX(F:F,SMALL(Tab_IIIE_VisionsPer17[III-E_Zeile],1+ROW(F358)-ROW($F$324))))","v":"Spielphasen Visionen"}]
[171,null,{"$f":"B_III_Sport_Konzept!R10","v":"Entwicklungsvisionen"},{"$f":"B_III_Sport_Konzept!S10","v":"-"},null,{"$f":"Tab_IIIE_VisionsPer17[[#This Row],[III-E_Funktionen]]","v":"Entwicklungsvisionen"},359,{"$f":"IF(ROW(C359)-ROW(C$324)+1>COUNT(Tab_IIIE_VisionsPer17[III-E_Zeile]),\"\",INDEX(F:F,SMALL(Tab_IIIE_VisionsPer17[III-E_Zeile],1+ROW(F359)-ROW($F$324))))","v":"Entwicklungsvisionen"}]
[]
["L_Nr.","III. Sportkonzept","III-F_Funktionen","III-F_Werte","III-F_100%","III-F_Funktion","III-F_Zeile","III-F_noch möglich"]
[172,{"$f":"B_III_Sport_Konzept!$B$6","v":"F. Sportperspektive"},{"$f":"B_III_Sport_Konzept!$L13","v":"BSpo1 - Ausbildungsstand der Trainer erhöhen"},{"$f":"B_III_Sport_Konzept!M13","v":"-"},null,{"$f":"Tab_IIIF_SportPer18[[#This Row],[III-F_Funktionen]]","v":"BSpo1 - Ausbildungsstand der Trainer erhöhen"},{"$f":"IF(COUNTIF($C$90:$C$101,F362)>=1,\"\",ROW())","v":362},{"$f":"IF(ROW(C362)-ROW(C$362)+1>COUNT(Tab_IIIF_SportPer18[III-F_Zeile]),\"\",INDEX(F:F,SMALL(Tab_IIIF_SportPer18[III-F_Zeile],1+ROW(F324)-ROW($F$324))))","v":"BSpo1 - Ausbildungsstand der Trainer erhöhen"}]
[173,null,{"$f":"B_III_Sport_Konzept!$L14","v":"BSpo2 - Quantität der NW-Spieler wird erhöht"},{"$f":"B_III_Sport_Konzept!M14","v":"-"},null,{"$f":"Tab_IIIF_SportPer18[[#This Row],[III-F_Funktionen]]","v":"BSpo2 - Quantität der NW-Spieler wird erhöht"},{"$f":"IF(COUNTIF($C$90:$C$101,F363)>=1,\"\",ROW())","v":363},{"$f":"IF(ROW(C363)-ROW(C$362)+1>COUNT(Tab_IIIF_SportPer18[III-F_Zeile]),\"\",INDEX(F:F,SMALL(Tab_IIIF_SportPer18[III-F_Zeile],1+ROW(F325)-ROW($F$324))))","v":"BSpo2 - Quantität der NW-Spieler wird erhöht"}]
[174,null,{"$f":"B_III_Sport_Konzept!$L15","v":"BSpo3 - Anteil der Eigenbauspieler in KM steigt"},{"$f":"B_III_Sport_Konzept!M15","v":"-"},null,{"$f":"Tab_IIIF_SportPer18[[#This Row],[III-F_Funktionen]]","v":"BSpo3 - Anteil der Eigenbauspieler in KM steigt"},364,{"$f":"IF(ROW(C364)-ROW(C$362)+1>COUNT(Tab_IIIF_SportPer18[III-F_Zeile]),\"\",INDEX(F:F,SMALL(Tab_IIIF_SportPer18[III-F_Zeile],1+ROW(F326)-ROW($F$324))))","v":"BSpo3 - Anteil der Eigenbauspieler in KM steigt"}]
[175,null,{"$f":"B_III_Sport_Konzept!$L16","v":"BSpo4 - Sportlicher Erfolg der KM steigt"},{"$f":"B_III_Sport_Konzept!M16","v":"-"},null,{"$f":"Tab_IIIF_SportPer18[[#This Row],[III-F_Funktionen]]","v":"BSpo4 - Sportlicher Erfolg der KM steigt"},365,{"$f":"IF(ROW(C365)-ROW(C$362)+1>COUNT(Tab_IIIF_SportPer18[III-F_Zeile]),\"\",INDEX(F:F,SMALL(Tab_IIIF_SportPer18[III-F_Zeile],1+ROW(F327)-ROW($F$324))))","v":"BSpo4 - Sportlicher Erfolg der KM steigt"}]
[176,null,{"$f":"B_III_Sport_Konzept!$L17","v":"Leitsätze"},{"$f":"B_III_Sport_Konzept!M17","v":"-"},null,{"$f":"Tab_IIIF_SportPer18[[#This Row],[III-F_Funktionen]]","v":"Leitsätze"},366,{"$f":"IF(ROW(C366)-ROW(C$362)+1>COUNT(Tab_IIIF_SportPer18[III-F_Zeile]),\"\",INDEX(F:F,SMALL(Tab_IIIF_SportPer18[III-F_Zeile],1+ROW(F328)-ROW($F$324))))","v":"Leitsätze"}]
[177,null,{"$f":"B_III_Sport_Konzept!$L18","v":"Qualität der NW wird erhöht"},{"$f":"B_III_Sport_Konzept!M18","v":"-"},null,{"$f":"Tab_IIIF_SportPer18[[#This Row],[III-F_Funktionen]]","v":"Qualität der NW wird erhöht"},367,{"$f":"IF(ROW(C367)-ROW(C$362)+1>COUNT(Tab_IIIF_SportPer18[III-F_Zeile]),\"\",INDEX(F:F,SMALL(Tab_IIIF_SportPer18[III-F_Zeile],1+ROW(F329)-ROW($F$324))))","v":"Qualität der NW wird erhöht"}]
[178,null,{"$f":"B_III_Sport_Konzept!$L19","v":"Qualität der KM Spieler wird erhöht"},{"$f":"B_III_Sport_Konzept!M19","v":"-"},null,{"$f":"Tab_IIIF_SportPer18[[#This Row],[III-F_Funktionen]]","v":"Qualität der KM Spieler wird erhöht"},368,{"$f":"IF(ROW(C368)-ROW(C$362)+1>COUNT(Tab_IIIF_SportPer18[III-F_Zeile]),\"\",INDEX(F:F,SMALL(Tab_IIIF_SportPer18[III-F_Zeile],1+ROW(F330)-ROW($F$324))))","v":"Qualität der KM Spieler wird erhöht"}]
[179,null,{"$f":"B_III_Sport_Konzept!$L20","v":"Interesse externer Spieler steigt"},{"$f":"B_III_Sport_Konzept!M20","v":"-"},null,{"$f":"Tab_IIIF_SportPer18[[#This Row],[III-F_Funktionen]]","v":"Interesse externer Spieler steigt"},369,{"$f":"IF(ROW(C369)-ROW(C$362)+1>COUNT(Tab_IIIF_SportPer18[III-F_Zeile]),\"\",INDEX(F:F,SMALL(Tab_IIIF_SportPer18[III-F_Zeile],1+ROW(F331)-ROW($F$324))))","v":"Interesse externer Spieler steigt"}]
[180,null,{"$f":"B_III_Sport_Konzept!$L21","v":"Passenden Trainer finden oder entwickeln"},{"$f":"B_III_Sport_Konzept!M21","v":"-"},null,{"$f":"Tab_IIIF_SportPer18[[#This Row],[III-F_Funktionen]]","v":"Passenden Trainer finden oder entwickeln"},370,{"$f":"IF(ROW(C370)-ROW(C$362)+1>COUNT(Tab_IIIF_SportPer18[III-F_Zeile]),\"\",INDEX(F:F,SMALL(Tab_IIIF_SportPer18[III-F_Zeile],1+ROW(F332)-ROW($F$324))))","v":"Passenden Trainer finden oder entwickeln"}]
[181,null,{"$f":"B_III_Sport_Konzept!$N13","v":"System-Auffassung"},{"$f":"B_III_Sport_Konzept!O13","v":"-"},null,{"$f":"Tab_IIIF_SportPer18[[#This Row],[III-F_Funktionen]]","v":"System-Auffassung"},371,{"$f":"IF(ROW(C371)-ROW(C$362)+1>COUNT(Tab_IIIF_SportPer18[III-F_Zeile]),\"\",INDEX(F:F,SMALL(Tab_IIIF_SportPer18[III-F_Zeile],1+ROW(F333)-ROW($F$324))))","v":"System-Auffassung"}]
[182,null,{"$f":"B_III_Sport_Konzept!$N14","v":"System-Auffassung_2"},{"$f":"B_III_Sport_Konzept!O14","v":"-"},null,{"$f":"Tab_IIIF_SportPer18[[#This Row],[III-F_Funktionen]]","v":"System-Auffassung_2"},372,{"$f":"IF(ROW(C372)-ROW(C$362)+1>COUNT(Tab_IIIF_SportPer18[III-F_Zeile]),\"\",INDEX(F:F,SMALL(Tab_IIIF_SportPer18[III-F_Zeile],1+ROW(F334)-ROW($F$324))))","v":"System-Auffassung_2"}]
[183,null,{"$f":"B_III_Sport_Konzept!$N15","v":"System-Auffassung_3"},{"$f":"B_III_Sport_Konzept!O15","v":"-"},null,{"$f":"Tab_IIIF_SportPer18[[#This Row],[III-F_Funktionen]]","v":"System-Auffassung_3"},373,{"$f":"IF(ROW(C373)-ROW(C$362)+1>COUNT(Tab_IIIF_SportPer18[III-F_Zeile]),\"\",INDEX(F:F,SMALL(Tab_IIIF_SportPer18[III-F_Zeile],1+ROW(F335)-ROW($F$324))))","v":"System-Auffassung_3"}]
[184,null,{"$f":"B_III_Sport_Konzept!$N16","v":"System-Auffassung_4"},{"$f":"B_III_Sport_Konzept!O16","v":"-"},null,{"$f":"Tab_IIIF_SportPer18[[#This Row],[III-F_Funktionen]]","v":"System-Auffassung_4"},374,{"$f":"IF(ROW(C374)-ROW(C$362)+1>COUNT(Tab_IIIF_SportPer18[III-F_Zeile]),\"\",INDEX(F:F,SMALL(Tab_IIIF_SportPer18[III-F_Zeile],1+ROW(F336)-ROW($F$324))))","v":"System-Auffassung_4"}]
[185,null,{"$f":"B_III_Sport_Konzept!$N17","v":"System-Auffassung_5"},{"$f":"B_III_Sport_Konzept!O17","v":"-"},null,{"$f":"Tab_IIIF_SportPer18[[#This Row],[III-F_Funktionen]]","v":"System-Auffassung_5"},375,{"$f":"IF(ROW(C375)-ROW(C$362)+1>COUNT(Tab_IIIF_SportPer18[III-F_Zeile]),\"\",INDEX(F:F,SMALL(Tab_IIIF_SportPer18[III-F_Zeile],1+ROW(F337)-ROW($F$324))))","v":"System-Auffassung_5"}]
[186,null,{"$f":"B_III_Sport_Konzept!$N18","v":"System-Auffassung_6"},{"$f":"B_III_Sport_Konzept!O18","v":"-"},null,{"$f":"Tab_IIIF_SportPer18[[#This Row],[III-F_Funktionen]]","v":"System-Auffassung_6"},376,{"$f":"IF(ROW(C376)-ROW(C$362)+1>COUNT(Tab_IIIF_SportPer18[III-F_Zeile]),\"\",INDEX(F:F,SMALL(Tab_IIIF_SportPer18[III-F_Zeile],1+ROW(F338)-ROW($F$324))))","v":"System-Auffassung_6"}]
[187,null,{"$f":"B_III_Sport_Konzept!$N19","v":"System-Auffassung_7"},{"$f":"B_III_Sport_Konzept!O19","v":"-"},null,{"$f":"Tab_IIIF_SportPer18[[#This Row],[III-F_Funktionen]]","v":"System-Auffassung_7"},377,{"$f":"IF(ROW(C377)-ROW(C$362)+1>COUNT(Tab_IIIF_SportPer18[III-F_Zeile]),\"\",INDEX(F:F,SMALL(Tab_IIIF_SportPer18[III-F_Zeile],1+ROW(F339)-ROW($F$324))))","v":"System-Auffassung_7"}]
[188,null,{"$f":"B_III_Sport_Konzept!$N20","v":"System-Auffassung_8"},{"$f":"B_III_Sport_Konzept!O20","v":"-"},null,{"$f":"Tab_IIIF_SportPer18[[#This Row],[III-F_Funktionen]]","v":"System-Auffassung_8"},378,{"$f":"IF(ROW(C378)-ROW(C$362)+1>COUNT(Tab_IIIF_SportPer18[III-F_Zeile]),\"\",INDEX(F:F,SMALL(Tab_IIIF_SportPer18[III-F_Zeile],1+ROW(F340)-ROW($F$324))))","v":"System-Auffassung_8"}]
[189,null,{"$f":"B_III_Sport_Konzept!$N21","v":"System-Auffassung_9"},{"$f":"B_III_Sport_Konzept!O21","v":"-"},null,{"$f":"Tab_IIIF_SportPer18[[#This Row],[III-F_Funktionen]]","v":"System-Auffassung_9"},379,{"$f":"IF(ROW(C379)-ROW(C$362)+1>COUNT(Tab_IIIF_SportPer18[III-F_Zeile]),\"\",INDEX(F:F,SMALL(Tab_IIIF_SportPer18[III-F_Zeile],1+ROW(F341)-ROW($F$324))))","v":"System-Auffassung_9"}]
[190,null,{"$f":"B_III_Sport_Konzept!$P13","v":"Spielplan"},{"$f":"B_III_Sport_Konzept!Q13","v":"-"},null,{"$f":"Tab_IIIF_SportPer18[[#This Row],[III-F_Funktionen]]","v":"Spielplan"},380,{"$f":"IF(ROW(C380)-ROW(C$362)+1>COUNT(Tab_IIIF_SportPer18[III-F_Zeile]),\"\",INDEX(F:F,SMALL(Tab_IIIF_SportPer18[III-F_Zeile],1+ROW(F342)-ROW($F$324))))","v":"Spielplan"}]
[191,null,{"$f":"B_III_Sport_Konzept!$P14","v":"Ausbildungsplan"},{"$f":"B_III_Sport_Konzept!Q14","v":"-"},null,{"$f":"Tab_IIIF_SportPer18[[#This Row],[III-F_Funktionen]]","v":"Ausbildungsplan"},381,{"$f":"IF(ROW(C381)-ROW(C$362)+1>COUNT(Tab_IIIF_SportPer18[III-F_Zeile]),\"\",INDEX(F:F,SMALL(Tab_IIIF_SportPer18[III-F_Zeile],1+ROW(F343)-ROW($F$324))))","v":"Ausbildungsplan"}]
[192,null,{"$f":"B_III_Sport_Konzept!$P15","v":"Trainingsplan"},{"$f":"B_III_Sport_Konzept!Q15","v":"-"},null,{"$f":"Tab_IIIF_SportPer18[[#This Row],[III-F_Funktionen]]","v":"Trainingsplan"},382,{"$f":"IF(ROW(C382)-ROW(C$362)+1>COUNT(Tab_IIIF_SportPer18[III-F_Zeile]),\"\",INDEX(F:F,SMALL(Tab_IIIF_SportPer18[III-F_Zeile],1+ROW(F344)-ROW($F$324))))","v":"Trainingsplan"}]
[193,null,{"$f":"B_III_Sport_Konzept!$P16","v":"Rahmenbedingung für Trainer verbessern"},{"$f":"B_III_Sport_Konzept!Q16","v":"-"},null,{"$f":"Tab_IIIF_SportPer18[[#This Row],[III-F_Funktionen]]","v":"Rahmenbedingung für Trainer verbessern"},383,{"$f":"IF(ROW(C383)-ROW(C$362)+1>COUNT(Tab_IIIF_SportPer18[III-F_Zeile]),\"\",INDEX(F:F,SMALL(Tab_IIIF_SportPer18[III-F_Zeile],1+ROW(F345)-ROW($F$324))))","v":"Rahmenbedingung für Trainer verbessern"}]
[194,null,{"$f":"B_III_Sport_Konzept!$P17","v":"Rahmenbedingung für Spieler verbessern"},{"$f":"B_III_Sport_Konzept!Q17","v":"-"},null,{"$f":"Tab_IIIF_SportPer18[[#This Row],[III-F_Funktionen]]","v":"Rahmenbedingung für Spieler verbessern"},384,{"$f":"IF(ROW(C384)-ROW(C$362)+1>COUNT(Tab_IIIF_SportPer18[III-F_Zeile]),\"\",INDEX(F:F,SMALL(Tab_IIIF_SportPer18[III-F_Zeile],1+ROW(F346)-ROW($F$324))))","v":"Rahmenbedingung für Spieler verbessern"}]
[195,null,{"$f":"B_III_Sport_Konzept!$P18","v":"Spiel-Trainings-Ausbildungsplan KM_6"},{"$f":"B_III_Sport_Konzept!Q18","v":"-"},null,{"$f":"Tab_IIIF_SportPer18[[#This Row],[III-F_Funktionen]]","v":"Spiel-Trainings-Ausbildungsplan KM_6"},385,{"$f":"IF(ROW(C385)-ROW(C$362)+1>COUNT(Tab_IIIF_SportPer18[III-F_Zeile]),\"\",INDEX(F:F,SMALL(Tab_IIIF_SportPer18[III-F_Zeile],1+ROW(F347)-ROW($F$324))))","v":"Spiel-Trainings-Ausbildungsplan KM_6"}]
[196,null,{"$f":"B_III_Sport_Konzept!$P19","v":"Spiel-Trainings-Ausbildungsplan KM_7"},{"$f":"B_III_Sport_Konzept!Q19","v":"-"},null,{"$f":"Tab_IIIF_SportPer18[[#This Row],[III-F_Funktionen]]","v":"Spiel-Trainings-Ausbildungsplan KM_7"},386,{"$f":"IF(ROW(C386)-ROW(C$362)+1>COUNT(Tab_IIIF_SportPer18[III-F_Zeile]),\"\",INDEX(F:F,SMALL(Tab_IIIF_SportPer18[III-F_Zeile],1+ROW(F348)-ROW($F$324))))","v":"Spiel-Trainings-Ausbildungsplan KM_7"}]
[197,null,{"$f":"B_III_Sport_Konzept!$P20","v":"Spiel-Trainings-Ausbildungsplan KM_8"},{"$f":"B_III_Sport_Konzept!Q20","v":"-"},null,{"$f":"Tab_IIIF_SportPer18[[#This Row],[III-F_Funktionen]]","v":"Spiel-Trainings-Ausbildungsplan KM_8"},387,{"$f":"IF(ROW(C387)-ROW(C$362)+1>COUNT(Tab_IIIF_SportPer18[III-F_Zeile]),\"\",INDEX(F:F,SMALL(Tab_IIIF_SportPer18[III-F_Zeile],1+ROW(F349)-ROW($F$324))))","v":"Spiel-Trainings-Ausbildungsplan KM_8"}]
[198,null,{"$f":"B_III_Sport_Konzept!$P21","v":"Spiel-Trainings-Ausbildungsplan KM_9"},{"$f":"B_III_Sport_Konzept!Q21","v":"-"},null,{"$f":"Tab_IIIF_SportPer18[[#This Row],[III-F_Funktionen]]","v":"Spiel-Trainings-Ausbildungsplan KM_9"},388,{"$f":"IF(ROW(C388)-ROW(C$362)+1>COUNT(Tab_IIIF_SportPer18[III-F_Zeile]),\"\",INDEX(F:F,SMALL(Tab_IIIF_SportPer18[III-F_Zeile],1+ROW(F350)-ROW($F$324))))","v":"Spiel-Trainings-Ausbildungsplan KM_9"}]
[199,null,{"$f":"B_III_Sport_Konzept!$R13","v":"Trainingsplan"},{"$f":"B_III_Sport_Konzept!S13","v":"-"},null,{"$f":"Tab_IIIF_SportPer18[[#This Row],[III-F_Funktionen]]","v":"Trainingsplan"},389,{"$f":"IF(ROW(C389)-ROW(C$362)+1>COUNT(Tab_IIIF_SportPer18[III-F_Zeile]),\"\",INDEX(F:F,SMALL(Tab_IIIF_SportPer18[III-F_Zeile],1+ROW(F351)-ROW($F$324))))","v":"Trainingsplan"}]
[200,null,{"$f":"B_III_Sport_Konzept!$R14","v":"Ausbildungsplan"},{"$f":"B_III_Sport_Konzept!S14","v":"-"},null,{"$f":"Tab_IIIF_SportPer18[[#This Row],[III-F_Funktionen]]","v":"Ausbildungsplan"},390,{"$f":"IF(ROW(C390)-ROW(C$362)+1>COUNT(Tab_IIIF_SportPer18[III-F_Zeile]),\"\",INDEX(F:F,SMALL(Tab_IIIF_SportPer18[III-F_Zeile],1+ROW(F352)-ROW($F$324))))","v":"Ausbildungsplan"}]
[201,null,{"$f":"B_III_Sport_Konzept!$R15","v":"Spielplan"},{"$f":"B_III_Sport_Konzept!S15","v":"-"},null,{"$f":"Tab_IIIF_SportPer18[[#This Row],[III-F_Funktionen]]","v":"Spielplan"},391,{"$f":"IF(ROW(C391)-ROW(C$362)+1>COUNT(Tab_IIIF_SportPer18[III-F_Zeile]),\"\",INDEX(F:F,SMALL(Tab_IIIF_SportPer18[III-F_Zeile],1+ROW(F353)-ROW($F$324))))","v":"Spielplan"}]
[202,null,{"$f":"B_III_Sport_Konzept!$R16","v":"Rahmenbedingung für NW-Trainer verbessern"},{"$f":"B_III_Sport_Konzept!S16","v":"-"},null,{"$f":"Tab_IIIF_SportPer18[[#This Row],[III-F_Funktionen]]","v":"Rahmenbedingung für NW-Trainer verbessern"},392,{"$f":"IF(ROW(C392)-ROW(C$362)+1>COUNT(Tab_IIIF_SportPer18[III-F_Zeile]),\"\",INDEX(F:F,SMALL(Tab_IIIF_SportPer18[III-F_Zeile],1+ROW(F354)-ROW($F$324))))","v":"Rahmenbedingung für NW-Trainer verbessern"}]
[203,null,{"$f":"B_III_Sport_Konzept!$R17","v":"Rahmenbedingung für NW-Spieler verbessern"},{"$f":"B_III_Sport_Konzept!S17","v":"-"},null,{"$f":"Tab_IIIF_SportPer18[[#This Row],[III-F_Funktionen]]","v":"Rahmenbedingung für NW-Spieler verbessern"},393,{"$f":"IF(ROW(C393)-ROW(C$362)+1>COUNT(Tab_IIIF_SportPer18[III-F_Zeile]),\"\",INDEX(F:F,SMALL(Tab_IIIF_SportPer18[III-F_Zeile],1+ROW(F355)-ROW($F$324))))","v":"Rahmenbedingung für NW-Spieler verbessern"}]
[204,null,{"$f":"B_III_Sport_Konzept!$R18","v":"Spiel-Trainings-Ausbildungsplan NW_6"},{"$f":"B_III_Sport_Konzept!S18","v":"-"},null,{"$f":"Tab_IIIF_SportPer18[[#This Row],[III-F_Funktionen]]","v":"Spiel-Trainings-Ausbildungsplan NW_6"},394,{"$f":"IF(ROW(C394)-ROW(C$362)+1>COUNT(Tab_IIIF_SportPer18[III-F_Zeile]),\"\",INDEX(F:F,SMALL(Tab_IIIF_SportPer18[III-F_Zeile],1+ROW(F356)-ROW($F$324))))","v":"Spiel-Trainings-Ausbildungsplan NW_6"}]
[205,null,{"$f":"B_III_Sport_Konzept!$R19","v":"Spiel-Trainings-Ausbildungsplan NW_7"},{"$f":"B_III_Sport_Konzept!S19","v":"-"},null,{"$f":"Tab_IIIF_SportPer18[[#This Row],[III-F_Funktionen]]","v":"Spiel-Trainings-Ausbildungsplan NW_7"},395,{"$f":"IF(ROW(C395)-ROW(C$362)+1>COUNT(Tab_IIIF_SportPer18[III-F_Zeile]),\"\",INDEX(F:F,SMALL(Tab_IIIF_SportPer18[III-F_Zeile],1+ROW(F357)-ROW($F$324))))","v":"Spiel-Trainings-Ausbildungsplan NW_7"}]
[206,null,{"$f":"B_III_Sport_Konzept!$R20","v":"Spiel-Trainings-Ausbildungsplan NW_8"},{"$f":"B_III_Sport_Konzept!S20","v":"-"},null,{"$f":"Tab_IIIF_SportPer18[[#This Row],[III-F_Funktionen]]","v":"Spiel-Trainings-Ausbildungsplan NW_8"},396,{"$f":"IF(ROW(C396)-ROW(C$362)+1>COUNT(Tab_IIIF_SportPer18[III-F_Zeile]),\"\",INDEX(F:F,SMALL(Tab_IIIF_SportPer18[III-F_Zeile],1+ROW(F358)-ROW($F$324))))","v":"Spiel-Trainings-Ausbildungsplan NW_8"}]
[207,null,{"$f":"B_III_Sport_Konzept!$R21","v":"Spiel-Trainings-Ausbildungsplan NW_9"},{"$f":"B_III_Sport_Konzept!S21","v":"-"},null,{"$f":"Tab_IIIF_SportPer18[[#This Row],[III-F_Funktionen]]","v":"Spiel-Trainings-Ausbildungsplan NW_9"},397,{"$f":"IF(ROW(C397)-ROW(C$362)+1>COUNT(Tab_IIIF_SportPer18[III-F_Zeile]),\"\",INDEX(F:F,SMALL(Tab_IIIF_SportPer18[III-F_Zeile],1+ROW(F359)-ROW($F$324))))","v":"Spiel-Trainings-Ausbildungsplan NW_9"}]
[]
["L_Nr.","III. Sportkonzept","III-G_Funktionen","III-G_Werte","III-G_100%","III-G_Funktion","III-G_Zeile","III-G_noch möglich"]
[208,{"$f":"B_III_Sport_Konzept!$B$7","v":"G. Sportumfeldperspektive"},{"$f":"B_III_Sport_Konzept!$L$24","v":"Sportumfeld-Test_1"},{"$f":"B_III_Sport_Konzept!M24","v":"-"},null,{"$f":"Tab_IIIG_SportumfeldPer19[[#This Row],[III-G_Funktionen]]","v":"Sportumfeld-Test_1"},{"$f":"IF(COUNTIF($C$102:$C$107,F400)>=1,\"\",ROW())","v":400},{"$f":"IF(ROW(C400)-ROW(C$400)+1>COUNT(Tab_IIIG_SportumfeldPer19[III-G_Zeile]),\"\",INDEX(F:F,SMALL(Tab_IIIG_SportumfeldPer19[III-G_Zeile],1+ROW(F400)-ROW($F$400))))","v":"Sportumfeld-Test_1"}]
[209,null,{"$f":"B_III_Sport_Konzept!$L$25","v":"Sportumfeld-Test_2"},{"$f":"B_III_Sport_Konzept!M25","v":"-"},null,{"$f":"Tab_IIIG_SportumfeldPer19[[#This Row],[III-G_Funktionen]]","v":"Sportumfeld-Test_2"},{"$f":"IF(COUNTIF($C$102:$C$107,F401)>=1,\"\",ROW())","v":401},{"$f":"IF(ROW(C401)-ROW(C$400)+1>COUNT(Tab_IIIG_SportumfeldPer19[III-G_Zeile]),\"\",INDEX(F:F,SMALL(Tab_IIIG_SportumfeldPer19[III-G_Zeile],1+ROW(F401)-ROW($F$400))))","v":"Sportumfeld-Test_2"}]
[210,null,{"$f":"B_III_Sport_Konzept!$L$26","v":"Sportumfeld-Test_3"},{"$f":"B_III_Sport_Konzept!M26","v":"-"},null,{"$f":"Tab_IIIG_SportumfeldPer19[[#This Row],[III-G_Funktionen]]","v":"Sportumfeld-Test_3"},402,{"$f":"IF(ROW(C402)-ROW(C$400)+1>COUNT(Tab_IIIG_SportumfeldPer19[III-G_Zeile]),\"\",INDEX(F:F,SMALL(Tab_IIIG_SportumfeldPer19[III-G_Zeile],1+ROW(F402)-ROW($F$400))))","v":"Sportumfeld-Test_3"}]
[211,null,{"$f":"B_III_Sport_Konzept!$L$27","v":"Sportumfeld-Test_4"},{"$f":"B_III_Sport_Konzept!M27","v":"-"},null,{"$f":"Tab_IIIG_SportumfeldPer19[[#This Row],[III-G_Funktionen]]","v":"Sportumfeld-Test_4"},403,{"$f":"IF(ROW(C403)-ROW(C$400)+1>COUNT(Tab_IIIG_SportumfeldPer19[III-G_Zeile]),\"\",INDEX(F:F,SMALL(Tab_IIIG_SportumfeldPer19[III-G_Zeile],1+ROW(F403)-ROW($F$400))))","v":"Sportumfeld-Test_4"}]
[212,null,{"$f":"B_III_Sport_Konzept!$L$28","v":"Sportumfeld-Test_5"},{"$f":"B_III_Sport_Konzept!M28","v":"-"},null,{"$f":"Tab_IIIG_SportumfeldPer19[[#This Row],[III-G_Funktionen]]","v":"Sportumfeld-Test_5"},404,{"$f":"IF(ROW(C404)-ROW(C$400)+1>COUNT(Tab_IIIG_SportumfeldPer19[III-G_Zeile]),\"\",INDEX(F:F,SMALL(Tab_IIIG_SportumfeldPer19[III-G_Zeile],1+ROW(F404)-ROW($F$400))))","v":"Sportumfeld-Test_5"}]
[213,null,{"$f":"B_III_Sport_Konzept!$L$29","v":"Sportumfeld-Test_6"},{"$f":"B_III_Sport_Konzept!M29","v":"-"},null,{"$f":"Tab_IIIG_SportumfeldPer19[[#This Row],[III-G_Funktionen]]","v":"Sportumfeld-Test_6"},405,{"$f":"IF(ROW(C405)-ROW(C$400)+1>COUNT(Tab_IIIG_SportumfeldPer19[III-G_Zeile]),\"\",INDEX(F:F,SMALL(Tab_IIIG_SportumfeldPer19[III-G_Zeile],1+ROW(F405)-ROW($F$400))))","v":"Sportumfeld-Test_6"}]
[214,null,{"$f":"B_III_Sport_Konzept!$L$30","v":"Sportumfeld-Test_7"},{"$f":"B_III_Sport_Konzept!M30","v":"-"},null,{"$f":"Tab_IIIG_SportumfeldPer19[[#This Row],[III-G_Funktionen]]","v":"Sportumfeld-Test_7"},406,{"$f":"IF(ROW(C406)-ROW(C$400)+1>COUNT(Tab_IIIG_SportumfeldPer19[III-G_Zeile]),\"\",INDEX(F:F,SMALL(Tab_IIIG_SportumfeldPer19[III-G_Zeile],1+ROW(F406)-ROW($F$400))))","v":"Sportumfeld-Test_7"}]
[215,null,{"$f":"B_III_Sport_Konzept!$L$31","v":"Sportumfeld-Test_8"},{"$f":"B_III_Sport_Konzept!M31","v":"-"},null,{"$f":"Tab_IIIG_SportumfeldPer19[[#This Row],[III-G_Funktionen]]","v":"Sportumfeld-Test_8"},407,{"$f":"IF(ROW(C407)-ROW(C$400)+1>COUNT(Tab_IIIG_SportumfeldPer19[III-G_Zeile]),\"\",INDEX(F:F,SMALL(Tab_IIIG_SportumfeldPer19[III-G_Zeile],1+ROW(F407)-ROW($F$400))))","v":"Sportumfeld-Test_8"}]
[216,null,{"$f":"B_III_Sport_Konzept!$L$32","v":"Sportumfeld-Test_9"},{"$f":"B_III_Sport_Konzept!M32","v":"-"},null,{"$f":"Tab_IIIG_SportumfeldPer19[[#This Row],[III-G_Funktionen]]","v":"Sportumfeld-Test_9"},408,{"$f":"IF(ROW(C408)-ROW(C$400)+1>COUNT(Tab_IIIG_SportumfeldPer19[III-G_Zeile]),\"\",INDEX(F:F,SMALL(Tab_IIIG_SportumfeldPer19[III-G_Zeile],1+ROW(F408)-ROW($F$400))))","v":"Sportumfeld-Test_9"}]
[217,null,{"$f":"B_III_Sport_Konzept!$N$24","v":"Sportumfeld_2-Test_1"},{"$f":"B_III_Sport_Konzept!O24","v":"-"},null,{"$f":"Tab_IIIG_SportumfeldPer19[[#This Row],[III-G_Funktionen]]","v":"Sportumfeld_2-Test_1"},409,{"$f":"IF(ROW(C409)-ROW(C$400)+1>COUNT(Tab_IIIG_SportumfeldPer19[III-G_Zeile]),\"\",INDEX(F:F,SMALL(Tab_IIIG_SportumfeldPer19[III-G_Zeile],1+ROW(F409)-ROW($F$400))))","v":"Sportumfeld_2-Test_1"}]
[218,null,{"$f":"B_III_Sport_Konzept!$N$25","v":"Sportumfeld_2-Test_2"},{"$f":"B_III_Sport_Konzept!O25","v":"-"},null,{"$f":"Tab_IIIG_SportumfeldPer19[[#This Row],[III-G_Funktionen]]","v":"Sportumfeld_2-Test_2"},410,{"$f":"IF(ROW(C410)-ROW(C$400)+1>COUNT(Tab_IIIG_SportumfeldPer19[III-G_Zeile]),\"\",INDEX(F:F,SMALL(Tab_IIIG_SportumfeldPer19[III-G_Zeile],1+ROW(F410)-ROW($F$400))))","v":"Sportumfeld_2-Test_2"}]
[219,null,{"$f":"B_III_Sport_Konzept!$N$26","v":"Sportumfeld_2-Test_3"},{"$f":"B_III_Sport_Konzept!O26","v":"-"},null,{"$f":"Tab_IIIG_SportumfeldPer19[[#This Row],[III-G_Funktionen]]","v":"Sportumfeld_2-Test_3"},411,{"$f":"IF(ROW(C411)-ROW(C$400)+1>COUNT(Tab_IIIG_SportumfeldPer19[III-G_Zeile]),\"\",INDEX(F:F,SMALL(Tab_IIIG_SportumfeldPer19[III-G_Zeile],1+ROW(F411)-ROW($F$400))))","v":"Sportumfeld_2-Test_3"}]
[220,null,{"$f":"B_III_Sport_Konzept!$N$27","v":"Sportumfeld_2-Test_4"},{"$f":"B_III_Sport_Konzept!O27","v":"-"},null,{"$f":"Tab_IIIG_SportumfeldPer19[[#This Row],[III-G_Funktionen]]","v":"Sportumfeld_2-Test_4"},412,{"$f":"IF(ROW(C412)-ROW(C$400)+1>COUNT(Tab_IIIG_SportumfeldPer19[III-G_Zeile]),\"\",INDEX(F:F,SMALL(Tab_IIIG_SportumfeldPer19[III-G_Zeile],1+ROW(F412)-ROW($F$400))))","v":"Sportumfeld_2-Test_4"}]
[221,null,{"$f":"B_III_Sport_Konzept!$N$28","v":"Sportumfeld_2-Test_5"},{"$f":"B_III_Sport_Konzept!O28","v":"-"},null,{"$f":"Tab_IIIG_SportumfeldPer19[[#This Row],[III-G_Funktionen]]","v":"Sportumfeld_2-Test_5"},413,{"$f":"IF(ROW(C413)-ROW(C$400)+1>COUNT(Tab_IIIG_SportumfeldPer19[III-G_Zeile]),\"\",INDEX(F:F,SMALL(Tab_IIIG_SportumfeldPer19[III-G_Zeile],1+ROW(F413)-ROW($F$400))))","v":"Sportumfeld_2-Test_5"}]
[222,null,{"$f":"B_III_Sport_Konzept!$N$29","v":"Sportumfeld_2-Test_6"},{"$f":"B_III_Sport_Konzept!O29","v":"-"},null,{"$f":"Tab_IIIG_SportumfeldPer19[[#This Row],[III-G_Funktionen]]","v":"Sportumfeld_2-Test_6"},414,{"$f":"IF(ROW(C414)-ROW(C$400)+1>COUNT(Tab_IIIG_SportumfeldPer19[III-G_Zeile]),\"\",INDEX(F:F,SMALL(Tab_IIIG_SportumfeldPer19[III-G_Zeile],1+ROW(F414)-ROW($F$400))))","v":"Sportumfeld_2-Test_6"}]
[223,null,{"$f":"B_III_Sport_Konzept!$N$30","v":"Sportumfeld_2-Test_7"},{"$f":"B_III_Sport_Konzept!O30","v":"-"},null,{"$f":"Tab_IIIG_SportumfeldPer19[[#This Row],[III-G_Funktionen]]","v":"Sportumfeld_2-Test_7"},415,{"$f":"IF(ROW(C415)-ROW(C$400)+1>COUNT(Tab_IIIG_SportumfeldPer19[III-G_Zeile]),\"\",INDEX(F:F,SMALL(Tab_IIIG_SportumfeldPer19[III-G_Zeile],1+ROW(F415)-ROW($F$400))))","v":"Sportumfeld_2-Test_7"}]
[224,null,{"$f":"B_III_Sport_Konzept!$N$31","v":"Sportumfeld_2-Test_8"},{"$f":"B_III_Sport_Konzept!O31","v":"-"},null,{"$f":"Tab_IIIG_SportumfeldPer19[[#This Row],[III-G_Funktionen]]","v":"Sportumfeld_2-Test_8"},416,{"$f":"IF(ROW(C416)-ROW(C$400)+1>COUNT(Tab_IIIG_SportumfeldPer19[III-G_Zeile]),\"\",INDEX(F:F,SMALL(Tab_IIIG_SportumfeldPer19[III-G_Zeile],1+ROW(F416)-ROW($F$400))))","v":"Sportumfeld_2-Test_8"}]
[225,null,{"$f":"B_III_Sport_Konzept!$N$32","v":"Sportumfeld_2-Test_9"},{"$f":"B_III_Sport_Konzept!O32","v":"-"},null,{"$f":"Tab_IIIG_SportumfeldPer19[[#This Row],[III-G_Funktionen]]","v":"Sportumfeld_2-Test_9"},417,{"$f":"IF(ROW(C417)-ROW(C$400)+1>COUNT(Tab_IIIG_SportumfeldPer19[III-G_Zeile]),\"\",INDEX(F:F,SMALL(Tab_IIIG_SportumfeldPer19[III-G_Zeile],1+ROW(F417)-ROW($F$400))))","v":"Sportumfeld_2-Test_9"}]
[]
["L_Nr.","IV. Vermarktungskonzept","IV-H_Funktionen","IV-H_Werte","IV-H_100%","IV-H_Funktion","IV-H_Zeile","IV-H_noch möglich"]
[226,{"$f":"B_IV_Vermarktungs_Konzept!$B$5","v":"H. Öffentlichkeitsperspektive"},{"$f":"B_IV_Vermarktungs_Konzept!$L2","v":"Grundstrategie"},{"$f":"B_IV_Vermarktungs_Konzept!M2","v":"-"},null,{"$f":"Tab_IVH_ÖffentlPer20[[#This Row],[IV-H_Funktionen]]","v":"Grundstrategie"},{"$f":"IF(COUNTIF($C$109:$C$123,F420)>=1,\"\",ROW())","v":420},{"$f":"IF(ROW(C420)-ROW(C$420)+1>COUNT(Tab_IVH_ÖffentlPer20[IV-H_Zeile]),\"\",INDEX(F:F,SMALL(Tab_IVH_ÖffentlPer20[IV-H_Zeile],1+ROW(F420)-ROW($F$420))))","v":"Grundstrategie"}]
[227,null,{"$f":"B_IV_Vermarktungs_Konzept!$L3","v":"Positionierung"},{"$f":"B_IV_Vermarktungs_Konzept!M3","v":"-"},null,{"$f":"Tab_IVH_ÖffentlPer20[[#This Row],[IV-H_Funktionen]]","v":"Positionierung"},{"$f":"IF(COUNTIF($C$109:$C$123,F421)>=1,\"\",ROW())","v":421},{"$f":"IF(ROW(C421)-ROW(C$420)+1>COUNT(Tab_IVH_ÖffentlPer20[IV-H_Zeile]),\"\",INDEX(F:F,SMALL(Tab_IVH_ÖffentlPer20[IV-H_Zeile],1+ROW(F421)-ROW($F$420))))","v":"Positionierung"}]
[228,null,{"$f":"B_IV_Vermarktungs_Konzept!$L4","v":"Darstellung nach Außen"},{"$f":"B_IV_Vermarktungs_Konzept!M4","v":"-"},null,{"$f":"Tab_IVH_ÖffentlPer20[[#This Row],[IV-H_Funktionen]]","v":"Darstellung nach Außen"},422,{"$f":"IF(ROW(C422)-ROW(C$420)+1>COUNT(Tab_IVH_ÖffentlPer20[IV-H_Zeile]),\"\",INDEX(F:F,SMALL(Tab_IVH_ÖffentlPer20[IV-H_Zeile],1+ROW(F422)-ROW($F$420))))","v":"Darstellung nach Außen"}]
[229,null,{"$f":"B_IV_Vermarktungs_Konzept!$L5","v":"Selbstbild des Vereins"},{"$f":"B_IV_Vermarktungs_Konzept!M5","v":"-"},null,{"$f":"Tab_IVH_ÖffentlPer20[[#This Row],[IV-H_Funktionen]]","v":"Selbstbild des Vereins"},423,{"$f":"IF(ROW(C423)-ROW(C$420)+1>COUNT(Tab_IVH_ÖffentlPer20[IV-H_Zeile]),\"\",INDEX(F:F,SMALL(Tab_IVH_ÖffentlPer20[IV-H_Zeile],1+ROW(F423)-ROW($F$420))))","v":"Selbstbild des Vereins"}]
[230,null,{"$f":"B_IV_Vermarktungs_Konzept!$L6","v":"Fremdbild des Vereins"},{"$f":"B_IV_Vermarktungs_Konzept!M6","v":"-"},null,{"$f":"Tab_IVH_ÖffentlPer20[[#This Row],[IV-H_Funktionen]]","v":"Fremdbild des Vereins"},424,{"$f":"IF(ROW(C424)-ROW(C$420)+1>COUNT(Tab_IVH_ÖffentlPer20[IV-H_Zeile]),\"\",INDEX(F:F,SMALL(Tab_IVH_ÖffentlPer20[IV-H_Zeile],1+ROW(F424)-ROW($F$420))))","v":"Fremdbild des Vereins"}]
[231,null,{"$f":"B_IV_Vermarktungs_Konzept!$L7","v":"Werte"},{"$f":"B_IV_Vermarktungs_Konzept!M7","v":"-"},null,{"$f":"Tab_IVH_ÖffentlPer20[[#This Row],[IV-H_Funktionen]]","v":"Werte"},425,{"$f":"IF(ROW(C425)-ROW(C$420)+1>COUNT(Tab_IVH_ÖffentlPer20[IV-H_Zeile]),\"\",INDEX(F:F,SMALL(Tab_IVH_ÖffentlPer20[IV-H_Zeile],1+ROW(F425)-ROW($F$420))))","v":"Werte"}]
[232,null,{"$f":"B_IV_Vermarktungs_Konzept!$L8","v":"Vereinsgelände"},{"$f":"B_IV_Vermarktungs_Konzept!M8","v":"-"},null,{"$f":"Tab_IVH_ÖffentlPer20[[#This Row],[IV-H_Funktionen]]","v":"Vereinsgelände"},426,{"$f":"IF(ROW(C426)-ROW(C$420)+1>COUNT(Tab_IVH_ÖffentlPer20[IV-H_Zeile]),\"\",INDEX(F:F,SMALL(Tab_IVH_ÖffentlPer20[IV-H_Zeile],1+ROW(F426)-ROW($F$420))))","v":"Vereinsgelände"}]
[233,null,{"$f":"B_IV_Vermarktungs_Konzept!$L9","v":"Denkhaltungen"},{"$f":"B_IV_Vermarktungs_Konzept!M9","v":"-"},null,{"$f":"Tab_IVH_ÖffentlPer20[[#This Row],[IV-H_Funktionen]]","v":"Denkhaltungen"},427,{"$f":"IF(ROW(C427)-ROW(C$420)+1>COUNT(Tab_IVH_ÖffentlPer20[IV-H_Zeile]),\"\",INDEX(F:F,SMALL(Tab_IVH_ÖffentlPer20[IV-H_Zeile],1+ROW(F427)-ROW($F$420))))","v":"Denkhaltungen"}]
[234,null,{"$f":"B_IV_Vermarktungs_Konzept!$L10","v":"Paradigmen"},{"$f":"B_IV_Vermarktungs_Konzept!M10","v":"-"},null,{"$f":"Tab_IVH_ÖffentlPer20[[#This Row],[IV-H_Funktionen]]","v":"Paradigmen"},428,{"$f":"IF(ROW(C428)-ROW(C$420)+1>COUNT(Tab_IVH_ÖffentlPer20[IV-H_Zeile]),\"\",INDEX(F:F,SMALL(Tab_IVH_ÖffentlPer20[IV-H_Zeile],1+ROW(F428)-ROW($F$420))))","v":"Paradigmen"}]
[235,null,{"$f":"B_IV_Vermarktungs_Konzept!$N2","v":"Vereinswebsite"},{"$f":"B_IV_Vermarktungs_Konzept!O2","v":"-"},null,{"$f":"Tab_IVH_ÖffentlPer20[[#This Row],[IV-H_Funktionen]]","v":"Vereinswebsite"},429,{"$f":"IF(ROW(C429)-ROW(C$420)+1>COUNT(Tab_IVH_ÖffentlPer20[IV-H_Zeile]),\"\",INDEX(F:F,SMALL(Tab_IVH_ÖffentlPer20[IV-H_Zeile],1+ROW(F429)-ROW($F$420))))","v":"Vereinswebsite"}]
[236,null,{"$f":"B_IV_Vermarktungs_Konzept!$N3","v":"Verbandswebsite"},{"$f":"B_IV_Vermarktungs_Konzept!O3","v":"-"},null,{"$f":"Tab_IVH_ÖffentlPer20[[#This Row],[IV-H_Funktionen]]","v":"Verbandswebsite"},430,{"$f":"IF(ROW(C430)-ROW(C$420)+1>COUNT(Tab_IVH_ÖffentlPer20[IV-H_Zeile]),\"\",INDEX(F:F,SMALL(Tab_IVH_ÖffentlPer20[IV-H_Zeile],1+ROW(F430)-ROW($F$420))))","v":"Verbandswebsite"}]
[237,null,{"$f":"B_IV_Vermarktungs_Konzept!$N4","v":"Soziale Medien"},{"$f":"B_IV_Vermarktungs_Konzept!O4","v":"-"},null,{"$f":"Tab_IVH_ÖffentlPer20[[#This Row],[IV-H_Funktionen]]","v":"Soziale Medien"},431,{"$f":"IF(ROW(C431)-ROW(C$420)+1>COUNT(Tab_IVH_ÖffentlPer20[IV-H_Zeile]),\"\",INDEX(F:F,SMALL(Tab_IVH_ÖffentlPer20[IV-H_Zeile],1+ROW(F431)-ROW($F$420))))","v":"Soziale Medien"}]
[238,null,{"$f":"B_IV_Vermarktungs_Konzept!$N5","v":"Spieltaginformation"},{"$f":"B_IV_Vermarktungs_Konzept!O5","v":"-"},null,{"$f":"Tab_IVH_ÖffentlPer20[[#This Row],[IV-H_Funktionen]]","v":"Spieltaginformation"},432,{"$f":"IF(ROW(C432)-ROW(C$420)+1>COUNT(Tab_IVH_ÖffentlPer20[IV-H_Zeile]),\"\",INDEX(F:F,SMALL(Tab_IVH_ÖffentlPer20[IV-H_Zeile],1+ROW(F432)-ROW($F$420))))","v":"Spieltaginformation"}]
[239,null,{"$f":"B_IV_Vermarktungs_Konzept!$N6","v":"E-Mail Informationen"},{"$f":"B_IV_Vermarktungs_Konzept!O6","v":"-"},null,{"$f":"Tab_IVH_ÖffentlPer20[[#This Row],[IV-H_Funktionen]]","v":"E-Mail Informationen"},433,{"$f":"IF(ROW(C433)-ROW(C$420)+1>COUNT(Tab_IVH_ÖffentlPer20[IV-H_Zeile]),\"\",INDEX(F:F,SMALL(Tab_IVH_ÖffentlPer20[IV-H_Zeile],1+ROW(F433)-ROW($F$420))))","v":"E-Mail Informationen"}]
[240,null,{"$f":"B_IV_Vermarktungs_Konzept!$N7","v":"Printmedien"},{"$f":"B_IV_Vermarktungs_Konzept!O7","v":"-"},null,{"$f":"Tab_IVH_ÖffentlPer20[[#This Row],[IV-H_Funktionen]]","v":"Printmedien"},434,{"$f":"IF(ROW(C434)-ROW(C$420)+1>COUNT(Tab_IVH_ÖffentlPer20[IV-H_Zeile]),\"\",INDEX(F:F,SMALL(Tab_IVH_ÖffentlPer20[IV-H_Zeile],1+ROW(F434)-ROW($F$420))))","v":"Printmedien"}]
[241,null,{"$f":"B_IV_Vermarktungs_Konzept!$N8","v":"Regional TV"},{"$f":"B_IV_Vermarktungs_Konzept!O8","v":"-"},null,{"$f":"Tab_IVH_ÖffentlPer20[[#This Row],[IV-H_Funktionen]]","v":"Regional TV"},435,{"$f":"IF(ROW(C435)-ROW(C$420)+1>COUNT(Tab_IVH_ÖffentlPer20[IV-H_Zeile]),\"\",INDEX(F:F,SMALL(Tab_IVH_ÖffentlPer20[IV-H_Zeile],1+ROW(F435)-ROW($F$420))))","v":"Regional TV"}]
[242,null,{"$f":"B_IV_Vermarktungs_Konzept!$N9","v":"Platzsprecher"},{"$f":"B_IV_Vermarktungs_Konzept!O9","v":"-"},null,{"$f":"Tab_IVH_ÖffentlPer20[[#This Row],[IV-H_Funktionen]]","v":"Platzsprecher"},436,{"$f":"IF(ROW(C436)-ROW(C$420)+1>COUNT(Tab_IVH_ÖffentlPer20[IV-H_Zeile]),\"\",INDEX(F:F,SMALL(Tab_IVH_ÖffentlPer20[IV-H_Zeile],1+ROW(F436)-ROW($F$420))))","v":"Platzsprecher"}]
[243,null,{"$f":"B_IV_Vermarktungs_Konzept!$N10","v":"Elternabende für NW Mannschaften"},{"$f":"B_IV_Vermarktungs_Konzept!O10","v":"-"},null,{"$f":"Tab_IVH_ÖffentlPer20[[#This Row],[IV-H_Funktionen]]","v":"Elternabende für NW Mannschaften"},437,{"$f":"IF(ROW(C437)-ROW(C$420)+1>COUNT(Tab_IVH_ÖffentlPer20[IV-H_Zeile]),\"\",INDEX(F:F,SMALL(Tab_IVH_ÖffentlPer20[IV-H_Zeile],1+ROW(F437)-ROW($F$420))))","v":"Elternabende für NW Mannschaften"}]
[244,null,{"$f":"B_IV_Vermarktungs_Konzept!$P2","v":"Kommunikation_1"},{"$f":"B_IV_Vermarktungs_Konzept!Q2","v":"-"},null,{"$f":"Tab_IVH_ÖffentlPer20[[#This Row],[IV-H_Funktionen]]","v":"Kommunikation_1"},438,{"$f":"IF(ROW(C438)-ROW(C$420)+1>COUNT(Tab_IVH_ÖffentlPer20[IV-H_Zeile]),\"\",INDEX(F:F,SMALL(Tab_IVH_ÖffentlPer20[IV-H_Zeile],1+ROW(F438)-ROW($F$420))))","v":"Kommunikation_1"}]
[245,null,{"$f":"B_IV_Vermarktungs_Konzept!$P3","v":"Kommunikation_2"},{"$f":"B_IV_Vermarktungs_Konzept!Q3","v":"-"},null,{"$f":"Tab_IVH_ÖffentlPer20[[#This Row],[IV-H_Funktionen]]","v":"Kommunikation_2"},439,{"$f":"IF(ROW(C439)-ROW(C$420)+1>COUNT(Tab_IVH_ÖffentlPer20[IV-H_Zeile]),\"\",INDEX(F:F,SMALL(Tab_IVH_ÖffentlPer20[IV-H_Zeile],1+ROW(F439)-ROW($F$420))))","v":"Kommunikation_2"}]
[246,null,{"$f":"B_IV_Vermarktungs_Konzept!$P4","v":"Kommunikation_3"},{"$f":"B_IV_Vermarktungs_Konzept!Q4","v":"-"},null,{"$f":"Tab_IVH_ÖffentlPer20[[#This Row],[IV-H_Funktionen]]","v":"Kommunikation_3"},440,{"$f":"IF(ROW(C440)-ROW(C$420)+1>COUNT(Tab_IVH_ÖffentlPer20[IV-H_Zeile]),\"\",INDEX(F:F,SMALL(Tab_IVH_ÖffentlPer20[IV-H_Zeile],1+ROW(F440)-ROW($F$420))))","v":"Kommunikation_3"}]
[247,null,{"$f":"B_IV_Vermarktungs_Konzept!$P5","v":"Kommunikation_4"},{"$f":"B_IV_Vermarktungs_Konzept!Q5","v":"-"},null,{"$f":"Tab_IVH_ÖffentlPer20[[#This Row],[IV-H_Funktionen]]","v":"Kommunikation_4"},441,{"$f":"IF(ROW(C441)-ROW(C$420)+1>COUNT(Tab_IVH_ÖffentlPer20[IV-H_Zeile]),\"\",INDEX(F:F,SMALL(Tab_IVH_ÖffentlPer20[IV-H_Zeile],1+ROW(F441)-ROW($F$420))))","v":"Kommunikation_4"}]
[248,null,{"$f":"B_IV_Vermarktungs_Konzept!$P6","v":"Kommunikation_5"},{"$f":"B_IV_Vermarktungs_Konzept!Q6","v":"-"},null,{"$f":"Tab_IVH_ÖffentlPer20[[#This Row],[IV-H_Funktionen]]","v":"Kommunikation_5"},442,{"$f":"IF(ROW(C442)-ROW(C$420)+1>COUNT(Tab_IVH_ÖffentlPer20[IV-H_Zeile]),\"\",INDEX(F:F,SMALL(Tab_IVH_ÖffentlPer20[IV-H_Zeile],1+ROW(F442)-ROW($F$420))))","v":"Kommunikation_5"}]
[249,null,{"$f":"B_IV_Vermarktungs_Konzept!$P7","v":"Kommunikation_6"},{"$f":"B_IV_Vermarktungs_Konzept!Q7","v":"-"},null,{"$f":"Tab_IVH_ÖffentlPer20[[#This Row],[IV-H_Funktionen]]","v":"Kommunikation_6"},443,{"$f":"IF(ROW(C443)-ROW(C$420)+1>COUNT(Tab_IVH_ÖffentlPer20[IV-H_Zeile]),\"\",INDEX(F:F,SMALL(Tab_IVH_ÖffentlPer20[IV-H_Zeile],1+ROW(F443)-ROW($F$420))))","v":"Kommunikation_6"}]
[250,null,{"$f":"B_IV_Vermarktungs_Konzept!$P8","v":"Kommunikation_7"},{"$f":"B_IV_Vermarktungs_Konzept!Q8","v":"-"},null,{"$f":"Tab_IVH_ÖffentlPer20[[#This Row],[IV-H_Funktionen]]","v":"Kommunikation_7"},444,{"$f":"IF(ROW(C444)-ROW(C$420)+1>COUNT(Tab_IVH_ÖffentlPer20[IV-H_Zeile]),\"\",INDEX(F:F,SMALL(Tab_IVH_ÖffentlPer20[IV-H_Zeile],1+ROW(F444)-ROW($F$420))))","v":"Kommunikation_7"}]
[251,null,{"$f":"B_IV_Vermarktungs_Konzept!$P9","v":"Kommunikation_8"},{"$f":"B_IV_Vermarktungs_Konzept!Q9","v":"-"},null,{"$f":"Tab_IVH_ÖffentlPer20[[#This Row],[IV-H_Funktionen]]","v":"Kommunikation_8"},445,{"$f":"IF(ROW(C445)-ROW(C$420)+1>COUNT(Tab_IVH_ÖffentlPer20[IV-H_Zeile]),\"\",INDEX(F:F,SMALL(Tab_IVH_ÖffentlPer20[IV-H_Zeile],1+ROW(F445)-ROW($F$420))))","v":"Kommunikation_8"}]
[252,null,{"$f":"B_IV_Vermarktungs_Konzept!$P10","v":"Kommunikation_9"},{"$f":"B_IV_Vermarktungs_Konzept!Q10","v":"-"},null,{"$f":"Tab_IVH_ÖffentlPer20[[#This Row],[IV-H_Funktionen]]","v":"Kommunikation_9"},446,{"$f":"IF(ROW(C446)-ROW(C$420)+1>COUNT(Tab_IVH_ÖffentlPer20[IV-H_Zeile]),\"\",INDEX(F:F,SMALL(Tab_IVH_ÖffentlPer20[IV-H_Zeile],1+ROW(F446)-ROW($F$420))))","v":"Kommunikation_9"}]
[253,null,{"$f":"B_IV_Vermarktungs_Konzept!$R2","v":"Musterevent_1"},{"$f":"B_IV_Vermarktungs_Konzept!S2","v":"-"},null,{"$f":"Tab_IVH_ÖffentlPer20[[#This Row],[IV-H_Funktionen]]","v":"Musterevent_1"},447,{"$f":"IF(ROW(C447)-ROW(C$420)+1>COUNT(Tab_IVH_ÖffentlPer20[IV-H_Zeile]),\"\",INDEX(F:F,SMALL(Tab_IVH_ÖffentlPer20[IV-H_Zeile],1+ROW(F447)-ROW($F$420))))","v":"Musterevent_1"}]
[254,null,{"$f":"B_IV_Vermarktungs_Konzept!$R3","v":"Musterevent_2"},{"$f":"B_IV_Vermarktungs_Konzept!S3","v":"-"},null,{"$f":"Tab_IVH_ÖffentlPer20[[#This Row],[IV-H_Funktionen]]","v":"Musterevent_2"},448,{"$f":"IF(ROW(C448)-ROW(C$420)+1>COUNT(Tab_IVH_ÖffentlPer20[IV-H_Zeile]),\"\",INDEX(F:F,SMALL(Tab_IVH_ÖffentlPer20[IV-H_Zeile],1+ROW(F448)-ROW($F$420))))","v":"Musterevent_2"}]
[255,null,{"$f":"B_IV_Vermarktungs_Konzept!$R4","v":"Musterevent_3"},{"$f":"B_IV_Vermarktungs_Konzept!S4","v":"-"},null,{"$f":"Tab_IVH_ÖffentlPer20[[#This Row],[IV-H_Funktionen]]","v":"Musterevent_3"},449,{"$f":"IF(ROW(C449)-ROW(C$420)+1>COUNT(Tab_IVH_ÖffentlPer20[IV-H_Zeile]),\"\",INDEX(F:F,SMALL(Tab_IVH_ÖffentlPer20[IV-H_Zeile],1+ROW(F449)-ROW($F$420))))","v":"Musterevent_3"}]
[256,null,{"$f":"B_IV_Vermarktungs_Konzept!$R5","v":"Musterevent_4"},{"$f":"B_IV_Vermarktungs_Konzept!S5","v":"-"},null,{"$f":"Tab_IVH_ÖffentlPer20[[#This Row],[IV-H_Funktionen]]","v":"Musterevent_4"},450,{"$f":"IF(ROW(C450)-ROW(C$420)+1>COUNT(Tab_IVH_ÖffentlPer20[IV-H_Zeile]),\"\",INDEX(F:F,SMALL(Tab_IVH_ÖffentlPer20[IV-H_Zeile],1+ROW(F450)-ROW($F$420))))","v":"Musterevent_4"}]
[257,null,{"$f":"B_IV_Vermarktungs_Konzept!$R6","v":"Musterevent_5"},{"$f":"B_IV_Vermarktungs_Konzept!S6","v":"-"},null,{"$f":"Tab_IVH_ÖffentlPer20[[#This Row],[IV-H_Funktionen]]","v":"Musterevent_5"},451,{"$f":"IF(ROW(C451)-ROW(C$420)+1>COUNT(Tab_IVH_ÖffentlPer20[IV-H_Zeile]),\"\",INDEX(F:F,SMALL(Tab_IVH_ÖffentlPer20[IV-H_Zeile],1+ROW(F451)-ROW($F$420))))","v":"Musterevent_5"}]
[258,null,{"$f":"B_IV_Vermarktungs_Konzept!$R7","v":"Musterevent_6"},{"$f":"B_IV_Vermarktungs_Konzept!S7","v":"-"},null,{"$f":"Tab_IVH_ÖffentlPer20[[#This Row],[IV-H_Funktionen]]","v":"Musterevent_6"},452,{"$f":"IF(ROW(C452)-ROW(C$420)+1>COUNT(Tab_IVH_ÖffentlPer20[IV-H_Zeile]),\"\",INDEX(F:F,SMALL(Tab_IVH_ÖffentlPer20[IV-H_Zeile],1+ROW(F452)-ROW($F$420))))","v":"Musterevent_6"}]
[259,null,{"$f":"B_IV_Vermarktungs_Konzept!$R8","v":"Musterevent_7"},{"$f":"B_IV_Vermarktungs_Konzept!S8","v":"-"},null,{"$f":"Tab_IVH_ÖffentlPer20[[#This Row],[IV-H_Funktionen]]","v":"Musterevent_7"},453,{"$f":"IF(ROW(C453)-ROW(C$420)+1>COUNT(Tab_IVH_ÖffentlPer20[IV-H_Zeile]),\"\",INDEX(F:F,SMALL(Tab_IVH_ÖffentlPer20[IV-H_Zeile],1+ROW(F453)-ROW($F$420))))","v":"Musterevent_7"}]
[260,null,{"$f":"B_IV_Vermarktungs_Konzept!$R9","v":"Musterevent_8"},{"$f":"B_IV_Vermarktungs_Konzept!S9","v":"-"},null,{"$f":"Tab_IVH_ÖffentlPer20[[#This Row],[IV-H_Funktionen]]","v":"Musterevent_8"},454,{"$f":"IF(ROW(C454)-ROW(C$420)+1>COUNT(Tab_IVH_ÖffentlPer20[IV-H_Zeile]),\"\",INDEX(F:F,SMALL(Tab_IVH_ÖffentlPer20[IV-H_Zeile],1+ROW(F454)-ROW($F$420))))","v":"Musterevent_8"}]
[261,null,{"$f":"B_IV_Vermarktungs_Konzept!$R10","v":"Musterevent_9"},{"$f":"B_IV_Vermarktungs_Konzept!S10","v":"-"},null,{"$f":"Tab_IVH_ÖffentlPer20[[#This Row],[IV-H_Funktionen]]","v":"Musterevent_9"},455,{"$f":"IF(ROW(C455)-ROW(C$420)+1>COUNT(Tab_IVH_ÖffentlPer20[IV-H_Zeile]),\"\",INDEX(F:F,SMALL(Tab_IVH_ÖffentlPer20[IV-H_Zeile],1+ROW(F455)-ROW($F$420))))","v":"Musterevent_9"}]
[262,null,{"$f":"B_IV_Vermarktungs_Konzept!$T2","v":"BMar1 - Mitgliederzahlen steigen"},{"$f":"B_IV_Vermarktungs_Konzept!U2","v":"-"},null,{"$f":"Tab_IVH_ÖffentlPer20[[#This Row],[IV-H_Funktionen]]","v":"BMar1 - Mitgliederzahlen steigen"},456,{"$f":"IF(ROW(C456)-ROW(C$420)+1>COUNT(Tab_IVH_ÖffentlPer20[IV-H_Zeile]),\"\",INDEX(F:F,SMALL(Tab_IVH_ÖffentlPer20[IV-H_Zeile],1+ROW(F456)-ROW($F$420))))","v":"BMar1 - Mitgliederzahlen steigen"}]
[263,null,{"$f":"B_IV_Vermarktungs_Konzept!$T3","v":"BMar2 - Anteil Freiwilligenarbeit steigt"},{"$f":"B_IV_Vermarktungs_Konzept!U3","v":"-"},null,{"$f":"Tab_IVH_ÖffentlPer20[[#This Row],[IV-H_Funktionen]]","v":"BMar2 - Anteil Freiwilligenarbeit steigt"},457,{"$f":"IF(ROW(C457)-ROW(C$420)+1>COUNT(Tab_IVH_ÖffentlPer20[IV-H_Zeile]),\"\",INDEX(F:F,SMALL(Tab_IVH_ÖffentlPer20[IV-H_Zeile],1+ROW(F457)-ROW($F$420))))","v":"BMar2 - Anteil Freiwilligenarbeit steigt"}]
[264,null,{"$f":"B_IV_Vermarktungs_Konzept!$T4","v":"BMar3 - Ausschöpfung Marketingkanäle"},{"$f":"B_IV_Vermarktungs_Konzept!U4","v":"-"},null,{"$f":"Tab_IVH_ÖffentlPer20[[#This Row],[IV-H_Funktionen]]","v":"BMar3 - Ausschöpfung Marketingkanäle"},458,{"$f":"IF(ROW(C458)-ROW(C$420)+1>COUNT(Tab_IVH_ÖffentlPer20[IV-H_Zeile]),\"\",INDEX(F:F,SMALL(Tab_IVH_ÖffentlPer20[IV-H_Zeile],1+ROW(F458)-ROW($F$420))))","v":"BMar3 - Ausschöpfung Marketingkanäle"}]
[265,null,{"$f":"B_IV_Vermarktungs_Konzept!$T5","v":"Bessere Argumente für Subventionen"},{"$f":"B_IV_Vermarktungs_Konzept!U5","v":"-"},null,{"$f":"Tab_IVH_ÖffentlPer20[[#This Row],[IV-H_Funktionen]]","v":"Bessere Argumente für Subventionen"},459,{"$f":"IF(ROW(C459)-ROW(C$420)+1>COUNT(Tab_IVH_ÖffentlPer20[IV-H_Zeile]),\"\",INDEX(F:F,SMALL(Tab_IVH_ÖffentlPer20[IV-H_Zeile],1+ROW(F459)-ROW($F$420))))","v":"Bessere Argumente für Subventionen"}]
[266,null,{"$f":"B_IV_Vermarktungs_Konzept!$T6","v":"Zuschauerzahlen steigen"},{"$f":"B_IV_Vermarktungs_Konzept!U6","v":"-"},null,{"$f":"Tab_IVH_ÖffentlPer20[[#This Row],[IV-H_Funktionen]]","v":"Zuschauerzahlen steigen"},460,{"$f":"IF(ROW(C460)-ROW(C$420)+1>COUNT(Tab_IVH_ÖffentlPer20[IV-H_Zeile]),\"\",INDEX(F:F,SMALL(Tab_IVH_ÖffentlPer20[IV-H_Zeile],1+ROW(F460)-ROW($F$420))))","v":"Zuschauerzahlen steigen"}]
[267,null,{"$f":"B_IV_Vermarktungs_Konzept!$T7","v":"Soziale Anerkennung steigt"},{"$f":"B_IV_Vermarktungs_Konzept!U7","v":"-"},null,{"$f":"Tab_IVH_ÖffentlPer20[[#This Row],[IV-H_Funktionen]]","v":"Soziale Anerkennung steigt"},461,{"$f":"IF(ROW(C461)-ROW(C$420)+1>COUNT(Tab_IVH_ÖffentlPer20[IV-H_Zeile]),\"\",INDEX(F:F,SMALL(Tab_IVH_ÖffentlPer20[IV-H_Zeile],1+ROW(F461)-ROW($F$420))))","v":"Soziale Anerkennung steigt"}]
[268,null,{"$f":"B_IV_Vermarktungs_Konzept!$T8","v":"Besserer Zugang zu (lokalen) Sponsoren"},{"$f":"B_IV_Vermarktungs_Konzept!U8","v":"-"},null,{"$f":"Tab_IVH_ÖffentlPer20[[#This Row],[IV-H_Funktionen]]","v":"Besserer Zugang zu (lokalen) Sponsoren"},462,{"$f":"IF(ROW(C462)-ROW(C$420)+1>COUNT(Tab_IVH_ÖffentlPer20[IV-H_Zeile]),\"\",INDEX(F:F,SMALL(Tab_IVH_ÖffentlPer20[IV-H_Zeile],1+ROW(F462)-ROW($F$420))))","v":"Besserer Zugang zu (lokalen) Sponsoren"}]
[269,null,{"$f":"B_IV_Vermarktungs_Konzept!$T9","v":"Benchmark_8"},{"$f":"B_IV_Vermarktungs_Konzept!U9","v":"-"},null,{"$f":"Tab_IVH_ÖffentlPer20[[#This Row],[IV-H_Funktionen]]","v":"Benchmark_8"},463,{"$f":"IF(ROW(C463)-ROW(C$420)+1>COUNT(Tab_IVH_ÖffentlPer20[IV-H_Zeile]),\"\",INDEX(F:F,SMALL(Tab_IVH_ÖffentlPer20[IV-H_Zeile],1+ROW(F463)-ROW($F$420))))","v":"Benchmark_8"}]
[270,null,{"$f":"B_IV_Vermarktungs_Konzept!$T10","v":"Benchmark_9"},{"$f":"B_IV_Vermarktungs_Konzept!U10","v":"-"},null,{"$f":"Tab_IVH_ÖffentlPer20[[#This Row],[IV-H_Funktionen]]","v":"Benchmark_9"},464,{"$f":"IF(ROW(C464)-ROW(C$420)+1>COUNT(Tab_IVH_ÖffentlPer20[IV-H_Zeile]),\"\",INDEX(F:F,SMALL(Tab_IVH_ÖffentlPer20[IV-H_Zeile],1+ROW(F464)-ROW($F$420))))","v":"Benchmark_9"}]
[]
["L_Nr.","IV. Vermarktungskonzept","IV-I_Funktionen","IV-I_Werte","IV-I_100%","IV-I_Funktion","IV-I_Zeile","IV-I_noch möglich"]
[271,{"$f":"B_IV_Vermarktungs_Konzept!$B$6","v":"I. Kommunikationsperspektive"},{"$f":"B_IV_Vermarktungs_Konzept!$L13","v":"Kommunikationsablauf_1"},{"$f":"B_IV_Vermarktungs_Konzept!M13","v":"-"},null,{"$f":"Tab_IVI_KommunikPer21[[#This Row],[IV-I_Funktionen]]","v":"Kommunikationsablauf_1"},{"$f":"IF(COUNTIF($C$124:$C$138,F467)>=1,\"\",ROW())","v":467},{"$f":"IF(ROW(C467)-ROW(C$467)+1>COUNT(Tab_IVI_KommunikPer21[IV-I_Zeile]),\"\",INDEX(F:F,SMALL(Tab_IVI_KommunikPer21[IV-I_Zeile],1+ROW(F467)-ROW($F$467))))","v":"Kommunikationsablauf_1"}]
[272,null,{"$f":"B_IV_Vermarktungs_Konzept!$L14","v":"Kommunikationsablauf_2"},{"$f":"B_IV_Vermarktungs_Konzept!M14","v":"-"},null,{"$f":"Tab_IVI_KommunikPer21[[#This Row],[IV-I_Funktionen]]","v":"Kommunikationsablauf_2"},{"$f":"IF(COUNTIF($C$124:$C$138,F468)>=1,\"\",ROW())","v":468},{"$f":"IF(ROW(C468)-ROW(C$467)+1>COUNT(Tab_IVI_KommunikPer21[IV-I_Zeile]),\"\",INDEX(F:F,SMALL(Tab_IVI_KommunikPer21[IV-I_Zeile],1+ROW(F468)-ROW($F$467))))","v":"Kommunikationsablauf_2"}]
[273,null,{"$f":"B_IV_Vermarktungs_Konzept!$L15","v":"Kommunikationsablauf_3"},{"$f":"B_IV_Vermarktungs_Konzept!M15","v":"-"},null,{"$f":"Tab_IVI_KommunikPer21[[#This Row],[IV-I_Funktionen]]","v":"Kommunikationsablauf_3"},469,{"$f":"IF(ROW(C469)-ROW(C$467)+1>COUNT(Tab_IVI_KommunikPer21[IV-I_Zeile]),\"\",INDEX(F:F,SMALL(Tab_IVI_KommunikPer21[IV-I_Zeile],1+ROW(F469)-ROW($F$467))))","v":"Kommunikationsablauf_3"}]
[274,null,{"$f":"B_IV_Vermarktungs_Konzept!$L16","v":"Kommunikationsablauf_4"},{"$f":"B_IV_Vermarktungs_Konzept!M16","v":"-"},null,{"$f":"Tab_IVI_KommunikPer21[[#This Row],[IV-I_Funktionen]]","v":"Kommunikationsablauf_4"},470,{"$f":"IF(ROW(C470)-ROW(C$467)+1>COUNT(Tab_IVI_KommunikPer21[IV-I_Zeile]),\"\",INDEX(F:F,SMALL(Tab_IVI_KommunikPer21[IV-I_Zeile],1+ROW(F470)-ROW($F$467))))","v":"Kommunikationsablauf_4"}]
[275,null,{"$f":"B_IV_Vermarktungs_Konzept!$L17","v":"Kommunikationsablauf_5"},{"$f":"B_IV_Vermarktungs_Konzept!M17","v":"-"},null,{"$f":"Tab_IVI_KommunikPer21[[#This Row],[IV-I_Funktionen]]","v":"Kommunikationsablauf_5"},471,{"$f":"IF(ROW(C471)-ROW(C$467)+1>COUNT(Tab_IVI_KommunikPer21[IV-I_Zeile]),\"\",INDEX(F:F,SMALL(Tab_IVI_KommunikPer21[IV-I_Zeile],1+ROW(F471)-ROW($F$467))))","v":"Kommunikationsablauf_5"}]
[276,null,{"$f":"B_IV_Vermarktungs_Konzept!$L18","v":"Kommunikationsablauf_6"},{"$f":"B_IV_Vermarktungs_Konzept!M18","v":"-"},null,{"$f":"Tab_IVI_KommunikPer21[[#This Row],[IV-I_Funktionen]]","v":"Kommunikationsablauf_6"},472,{"$f":"IF(ROW(C472)-ROW(C$467)+1>COUNT(Tab_IVI_KommunikPer21[IV-I_Zeile]),\"\",INDEX(F:F,SMALL(Tab_IVI_KommunikPer21[IV-I_Zeile],1+ROW(F472)-ROW($F$467))))","v":"Kommunikationsablauf_6"}]
[277,null,{"$f":"B_IV_Vermarktungs_Konzept!$L19","v":"Kommunikationsablauf_7"},{"$f":"B_IV_Vermarktungs_Konzept!M19","v":"-"},null,{"$f":"Tab_IVI_KommunikPer21[[#This Row],[IV-I_Funktionen]]","v":"Kommunikationsablauf_7"},473,{"$f":"IF(ROW(C473)-ROW(C$467)+1>COUNT(Tab_IVI_KommunikPer21[IV-I_Zeile]),\"\",INDEX(F:F,SMALL(Tab_IVI_KommunikPer21[IV-I_Zeile],1+ROW(F473)-ROW($F$467))))","v":"Kommunikationsablauf_7"}]
[278,null,{"$f":"B_IV_Vermarktungs_Konzept!$L20","v":"Kommunikationsablauf_8"},{"$f":"B_IV_Vermarktungs_Konzept!M20","v":"-"},null,{"$f":"Tab_IVI_KommunikPer21[[#This Row],[IV-I_Funktionen]]","v":"Kommunikationsablauf_8"},474,{"$f":"IF(ROW(C474)-ROW(C$467)+1>COUNT(Tab_IVI_KommunikPer21[IV-I_Zeile]),\"\",INDEX(F:F,SMALL(Tab_IVI_KommunikPer21[IV-I_Zeile],1+ROW(F474)-ROW($F$467))))","v":"Kommunikationsablauf_8"}]
[279,null,{"$f":"B_IV_Vermarktungs_Konzept!$L21","v":"Kommunikationsablauf_9"},{"$f":"B_IV_Vermarktungs_Konzept!M21","v":"-"},null,{"$f":"Tab_IVI_KommunikPer21[[#This Row],[IV-I_Funktionen]]","v":"Kommunikationsablauf_9"},475,{"$f":"IF(ROW(C475)-ROW(C$467)+1>COUNT(Tab_IVI_KommunikPer21[IV-I_Zeile]),\"\",INDEX(F:F,SMALL(Tab_IVI_KommunikPer21[IV-I_Zeile],1+ROW(F475)-ROW($F$467))))","v":"Kommunikationsablauf_9"}]
[280,null,{"$f":"B_IV_Vermarktungs_Konzept!$N13","v":"Kommunikation Heute"},{"$f":"B_IV_Vermarktungs_Konzept!O13","v":"-"},null,{"$f":"Tab_IVI_KommunikPer21[[#This Row],[IV-I_Funktionen]]","v":"Kommunikation Heute"},476,{"$f":"IF(ROW(C476)-ROW(C$467)+1>COUNT(Tab_IVI_KommunikPer21[IV-I_Zeile]),\"\",INDEX(F:F,SMALL(Tab_IVI_KommunikPer21[IV-I_Zeile],1+ROW(F476)-ROW($F$467))))","v":"Kommunikation Heute"}]
[281,null,{"$f":"B_IV_Vermarktungs_Konzept!$N14","v":"Soziale Medien "},{"$f":"B_IV_Vermarktungs_Konzept!O14","v":"-"},null,{"$f":"Tab_IVI_KommunikPer21[[#This Row],[IV-I_Funktionen]]","v":"Soziale Medien "},477,{"$f":"IF(ROW(C477)-ROW(C$467)+1>COUNT(Tab_IVI_KommunikPer21[IV-I_Zeile]),\"\",INDEX(F:F,SMALL(Tab_IVI_KommunikPer21[IV-I_Zeile],1+ROW(F477)-ROW($F$467))))","v":"Soziale Medien "}]
[282,null,{"$f":"B_IV_Vermarktungs_Konzept!$N15","v":"Kommunikation Heute_3"},{"$f":"B_IV_Vermarktungs_Konzept!O15","v":"-"},null,{"$f":"Tab_IVI_KommunikPer21[[#This Row],[IV-I_Funktionen]]","v":"Kommunikation Heute_3"},478,{"$f":"IF(ROW(C478)-ROW(C$467)+1>COUNT(Tab_IVI_KommunikPer21[IV-I_Zeile]),\"\",INDEX(F:F,SMALL(Tab_IVI_KommunikPer21[IV-I_Zeile],1+ROW(F478)-ROW($F$467))))","v":"Kommunikation Heute_3"}]
[283,null,{"$f":"B_IV_Vermarktungs_Konzept!$N16","v":"Kommunikation Heute_4"},{"$f":"B_IV_Vermarktungs_Konzept!O16","v":"-"},null,{"$f":"Tab_IVI_KommunikPer21[[#This Row],[IV-I_Funktionen]]","v":"Kommunikation Heute_4"},479,{"$f":"IF(ROW(C479)-ROW(C$467)+1>COUNT(Tab_IVI_KommunikPer21[IV-I_Zeile]),\"\",INDEX(F:F,SMALL(Tab_IVI_KommunikPer21[IV-I_Zeile],1+ROW(F479)-ROW($F$467))))","v":"Kommunikation Heute_4"}]
[284,null,{"$f":"B_IV_Vermarktungs_Konzept!$N17","v":"Kommunikation Heute_5"},{"$f":"B_IV_Vermarktungs_Konzept!O17","v":"-"},null,{"$f":"Tab_IVI_KommunikPer21[[#This Row],[IV-I_Funktionen]]","v":"Kommunikation Heute_5"},480,{"$f":"IF(ROW(C480)-ROW(C$467)+1>COUNT(Tab_IVI_KommunikPer21[IV-I_Zeile]),\"\",INDEX(F:F,SMALL(Tab_IVI_KommunikPer21[IV-I_Zeile],1+ROW(F480)-ROW($F$467))))","v":"Kommunikation Heute_5"}]
[285,null,{"$f":"B_IV_Vermarktungs_Konzept!$N18","v":"Kommunikation Heute_6"},{"$f":"B_IV_Vermarktungs_Konzept!O18","v":"-"},null,{"$f":"Tab_IVI_KommunikPer21[[#This Row],[IV-I_Funktionen]]","v":"Kommunikation Heute_6"},481,{"$f":"IF(ROW(C481)-ROW(C$467)+1>COUNT(Tab_IVI_KommunikPer21[IV-I_Zeile]),\"\",INDEX(F:F,SMALL(Tab_IVI_KommunikPer21[IV-I_Zeile],1+ROW(F481)-ROW($F$467))))","v":"Kommunikation Heute_6"}]
[286,null,{"$f":"B_IV_Vermarktungs_Konzept!$N19","v":"Kommunikation Heute_7"},{"$f":"B_IV_Vermarktungs_Konzept!O19","v":"-"},null,{"$f":"Tab_IVI_KommunikPer21[[#This Row],[IV-I_Funktionen]]","v":"Kommunikation Heute_7"},482,{"$f":"IF(ROW(C482)-ROW(C$467)+1>COUNT(Tab_IVI_KommunikPer21[IV-I_Zeile]),\"\",INDEX(F:F,SMALL(Tab_IVI_KommunikPer21[IV-I_Zeile],1+ROW(F482)-ROW($F$467))))","v":"Kommunikation Heute_7"}]
[287,null,{"$f":"B_IV_Vermarktungs_Konzept!$N20","v":"Kommunikation Heute_8"},{"$f":"B_IV_Vermarktungs_Konzept!O20","v":"-"},null,{"$f":"Tab_IVI_KommunikPer21[[#This Row],[IV-I_Funktionen]]","v":"Kommunikation Heute_8"},483,{"$f":"IF(ROW(C483)-ROW(C$467)+1>COUNT(Tab_IVI_KommunikPer21[IV-I_Zeile]),\"\",INDEX(F:F,SMALL(Tab_IVI_KommunikPer21[IV-I_Zeile],1+ROW(F483)-ROW($F$467))))","v":"Kommunikation Heute_8"}]
[288,null,{"$f":"B_IV_Vermarktungs_Konzept!$N21","v":"Kommunikation Heute_9"},{"$f":"B_IV_Vermarktungs_Konzept!O21","v":"-"},null,{"$f":"Tab_IVI_KommunikPer21[[#This Row],[IV-I_Funktionen]]","v":"Kommunikation Heute_9"},484,{"$f":"IF(ROW(C484)-ROW(C$467)+1>COUNT(Tab_IVI_KommunikPer21[IV-I_Zeile]),\"\",INDEX(F:F,SMALL(Tab_IVI_KommunikPer21[IV-I_Zeile],1+ROW(F484)-ROW($F$467))))","v":"Kommunikation Heute_9"}]
[289,null,{"$f":"B_IV_Vermarktungs_Konzept!$P13","v":"Was möchte ich mit Kom. erreichen"},{"$f":"B_IV_Vermarktungs_Konzept!Q13","v":"-"},null,{"$f":"Tab_IVI_KommunikPer21[[#This Row],[IV-I_Funktionen]]","v":"Was möchte ich mit Kom. erreichen"},485,{"$f":"IF(ROW(C485)-ROW(C$467)+1>COUNT(Tab_IVI_KommunikPer21[IV-I_Zeile]),\"\",INDEX(F:F,SMALL(Tab_IVI_KommunikPer21[IV-I_Zeile],1+ROW(F485)-ROW($F$467))))","v":"Was möchte ich mit Kom. erreichen"}]
[290,null,{"$f":"B_IV_Vermarktungs_Konzept!$P14","v":"Warum ist mir Kommunikation wichtig"},{"$f":"B_IV_Vermarktungs_Konzept!Q14","v":"-"},null,{"$f":"Tab_IVI_KommunikPer21[[#This Row],[IV-I_Funktionen]]","v":"Warum ist mir Kommunikation wichtig"},486,{"$f":"IF(ROW(C486)-ROW(C$467)+1>COUNT(Tab_IVI_KommunikPer21[IV-I_Zeile]),\"\",INDEX(F:F,SMALL(Tab_IVI_KommunikPer21[IV-I_Zeile],1+ROW(F486)-ROW($F$467))))","v":"Warum ist mir Kommunikation wichtig"}]
[291,null,{"$f":"B_IV_Vermarktungs_Konzept!$P15","v":"Wen möchte ich erreichen"},{"$f":"B_IV_Vermarktungs_Konzept!Q15","v":"-"},null,{"$f":"Tab_IVI_KommunikPer21[[#This Row],[IV-I_Funktionen]]","v":"Wen möchte ich erreichen"},487,{"$f":"IF(ROW(C487)-ROW(C$467)+1>COUNT(Tab_IVI_KommunikPer21[IV-I_Zeile]),\"\",INDEX(F:F,SMALL(Tab_IVI_KommunikPer21[IV-I_Zeile],1+ROW(F487)-ROW($F$467))))","v":"Wen möchte ich erreichen"}]
[292,null,{"$f":"B_IV_Vermarktungs_Konzept!$P16","v":"Wer ist meine Ziel-/Dialoggruppe"},{"$f":"B_IV_Vermarktungs_Konzept!Q16","v":"-"},null,{"$f":"Tab_IVI_KommunikPer21[[#This Row],[IV-I_Funktionen]]","v":"Wer ist meine Ziel-/Dialoggruppe"},488,{"$f":"IF(ROW(C488)-ROW(C$467)+1>COUNT(Tab_IVI_KommunikPer21[IV-I_Zeile]),\"\",INDEX(F:F,SMALL(Tab_IVI_KommunikPer21[IV-I_Zeile],1+ROW(F488)-ROW($F$467))))","v":"Wer ist meine Ziel-/Dialoggruppe"}]
[293,null,{"$f":"B_IV_Vermarktungs_Konzept!$P17","v":"Was ist der Neuigkeitswert"},{"$f":"B_IV_Vermarktungs_Konzept!Q17","v":"-"},null,{"$f":"Tab_IVI_KommunikPer21[[#This Row],[IV-I_Funktionen]]","v":"Was ist der Neuigkeitswert"},489,{"$f":"IF(ROW(C489)-ROW(C$467)+1>COUNT(Tab_IVI_KommunikPer21[IV-I_Zeile]),\"\",INDEX(F:F,SMALL(Tab_IVI_KommunikPer21[IV-I_Zeile],1+ROW(F489)-ROW($F$467))))","v":"Was ist der Neuigkeitswert"}]
[294,null,{"$f":"B_IV_Vermarktungs_Konzept!$P18","v":"Was ist anders, wenn wir gut kommunizieren"},{"$f":"B_IV_Vermarktungs_Konzept!Q18","v":"-"},null,{"$f":"Tab_IVI_KommunikPer21[[#This Row],[IV-I_Funktionen]]","v":"Was ist anders, wenn wir gut kommunizieren"},490,{"$f":"IF(ROW(C490)-ROW(C$467)+1>COUNT(Tab_IVI_KommunikPer21[IV-I_Zeile]),\"\",INDEX(F:F,SMALL(Tab_IVI_KommunikPer21[IV-I_Zeile],1+ROW(F490)-ROW($F$467))))","v":"Was ist anders, wenn wir gut kommunizieren"}]
[295,null,{"$f":"B_IV_Vermarktungs_Konzept!$P19","v":"leer"},{"$f":"B_IV_Vermarktungs_Konzept!Q19","v":"-"},null,{"$f":"Tab_IVI_KommunikPer21[[#This Row],[IV-I_Funktionen]]","v":"leer"},491,{"$f":"IF(ROW(C491)-ROW(C$467)+1>COUNT(Tab_IVI_KommunikPer21[IV-I_Zeile]),\"\",INDEX(F:F,SMALL(Tab_IVI_KommunikPer21[IV-I_Zeile],1+ROW(F491)-ROW($F$467))))","v":"leer"}]
[296,null,{"$f":"B_IV_Vermarktungs_Konzept!$P20","v":"leer"},{"$f":"B_IV_Vermarktungs_Konzept!Q20","v":"-"},null,{"$f":"Tab_IVI_KommunikPer21[[#This Row],[IV-I_Funktionen]]","v":"leer"},492,{"$f":"IF(ROW(C492)-ROW(C$467)+1>COUNT(Tab_IVI_KommunikPer21[IV-I_Zeile]),\"\",INDEX(F:F,SMALL(Tab_IVI_KommunikPer21[IV-I_Zeile],1+ROW(F492)-ROW($F$467))))","v":"leer"}]
[297,null,{"$f":"B_IV_Vermarktungs_Konzept!$P21","v":"leer"},{"$f":"B_IV_Vermarktungs_Konzept!Q21","v":"-"},null,{"$f":"Tab_IVI_KommunikPer21[[#This Row],[IV-I_Funktionen]]","v":"leer"},493,{"$f":"IF(ROW(C493)-ROW(C$467)+1>COUNT(Tab_IVI_KommunikPer21[IV-I_Zeile]),\"\",INDEX(F:F,SMALL(Tab_IVI_KommunikPer21[IV-I_Zeile],1+ROW(F493)-ROW($F$467))))","v":"leer"}]
[298,null,{"$f":"B_IV_Vermarktungs_Konzept!$R13","v":"Kommunikation nach Innen"},{"$f":"B_IV_Vermarktungs_Konzept!S13","v":"-"},null,{"$f":"Tab_IVI_KommunikPer21[[#This Row],[IV-I_Funktionen]]","v":"Kommunikation nach Innen"},494,{"$f":"IF(ROW(C494)-ROW(C$467)+1>COUNT(Tab_IVI_KommunikPer21[IV-I_Zeile]),\"\",INDEX(F:F,SMALL(Tab_IVI_KommunikPer21[IV-I_Zeile],1+ROW(F494)-ROW($F$467))))","v":"Kommunikation nach Innen"}]
[299,null,{"$f":"B_IV_Vermarktungs_Konzept!$R14","v":"Kommunikation nach Außen"},{"$f":"B_IV_Vermarktungs_Konzept!S14","v":"-"},null,{"$f":"Tab_IVI_KommunikPer21[[#This Row],[IV-I_Funktionen]]","v":"Kommunikation nach Außen"},495,{"$f":"IF(ROW(C495)-ROW(C$467)+1>COUNT(Tab_IVI_KommunikPer21[IV-I_Zeile]),\"\",INDEX(F:F,SMALL(Tab_IVI_KommunikPer21[IV-I_Zeile],1+ROW(F495)-ROW($F$467))))","v":"Kommunikation nach Außen"}]
[300,null,{"$f":"B_IV_Vermarktungs_Konzept!$R15","v":"Kommunikation Innen/Außen_3"},{"$f":"B_IV_Vermarktungs_Konzept!S15","v":"-"},null,{"$f":"Tab_IVI_KommunikPer21[[#This Row],[IV-I_Funktionen]]","v":"Kommunikation Innen/Außen_3"},496,{"$f":"IF(ROW(C496)-ROW(C$467)+1>COUNT(Tab_IVI_KommunikPer21[IV-I_Zeile]),\"\",INDEX(F:F,SMALL(Tab_IVI_KommunikPer21[IV-I_Zeile],1+ROW(F496)-ROW($F$467))))","v":"Kommunikation Innen/Außen_3"}]
[301,null,{"$f":"B_IV_Vermarktungs_Konzept!$R16","v":"Kommunikation Innen/Außen_4"},{"$f":"B_IV_Vermarktungs_Konzept!S16","v":"-"},null,{"$f":"Tab_IVI_KommunikPer21[[#This Row],[IV-I_Funktionen]]","v":"Kommunikation Innen/Außen_4"},497,{"$f":"IF(ROW(C497)-ROW(C$467)+1>COUNT(Tab_IVI_KommunikPer21[IV-I_Zeile]),\"\",INDEX(F:F,SMALL(Tab_IVI_KommunikPer21[IV-I_Zeile],1+ROW(F497)-ROW($F$467))))","v":"Kommunikation Innen/Außen_4"}]
[302,null,{"$f":"B_IV_Vermarktungs_Konzept!$R17","v":"Kommunikation Innen/Außen_5"},{"$f":"B_IV_Vermarktungs_Konzept!S17","v":"-"},null,{"$f":"Tab_IVI_KommunikPer21[[#This Row],[IV-I_Funktionen]]","v":"Kommunikation Innen/Außen_5"},498,{"$f":"IF(ROW(C498)-ROW(C$467)+1>COUNT(Tab_IVI_KommunikPer21[IV-I_Zeile]),\"\",INDEX(F:F,SMALL(Tab_IVI_KommunikPer21[IV-I_Zeile],1+ROW(F498)-ROW($F$467))))","v":"Kommunikation Innen/Außen_5"}]
[303,null,{"$f":"B_IV_Vermarktungs_Konzept!$R18","v":"Kommunikation Innen/Außen_6"},{"$f":"B_IV_Vermarktungs_Konzept!S18","v":"-"},null,{"$f":"Tab_IVI_KommunikPer21[[#This Row],[IV-I_Funktionen]]","v":"Kommunikation Innen/Außen_6"},499,{"$f":"IF(ROW(C499)-ROW(C$467)+1>COUNT(Tab_IVI_KommunikPer21[IV-I_Zeile]),\"\",INDEX(F:F,SMALL(Tab_IVI_KommunikPer21[IV-I_Zeile],1+ROW(F499)-ROW($F$467))))","v":"Kommunikation Innen/Außen_6"}]
[304,null,{"$f":"B_IV_Vermarktungs_Konzept!$R19","v":"Kommunikation Innen/Außen_7"},{"$f":"B_IV_Vermarktungs_Konzept!S19","v":"-"},null,{"$f":"Tab_IVI_KommunikPer21[[#This Row],[IV-I_Funktionen]]","v":"Kommunikation Innen/Außen_7"},500,{"$f":"IF(ROW(C500)-ROW(C$467)+1>COUNT(Tab_IVI_KommunikPer21[IV-I_Zeile]),\"\",INDEX(F:F,SMALL(Tab_IVI_KommunikPer21[IV-I_Zeile],1+ROW(F500)-ROW($F$467))))","v":"Kommunikation Innen/Außen_7"}]
[305,null,{"$f":"B_IV_Vermarktungs_Konzept!$R20","v":"Kommunikation Innen/Außen_8"},{"$f":"B_IV_Vermarktungs_Konzept!S20","v":"-"},null,{"$f":"Tab_IVI_KommunikPer21[[#This Row],[IV-I_Funktionen]]","v":"Kommunikation Innen/Außen_8"},501,{"$f":"IF(ROW(C501)-ROW(C$467)+1>COUNT(Tab_IVI_KommunikPer21[IV-I_Zeile]),\"\",INDEX(F:F,SMALL(Tab_IVI_KommunikPer21[IV-I_Zeile],1+ROW(F501)-ROW($F$467))))","v":"Kommunikation Innen/Außen_8"}]
[306,null,{"$f":"B_IV_Vermarktungs_Konzept!$R21","v":"Kommunikation Innen/Außen_9"},{"$f":"B_IV_Vermarktungs_Konzept!S21","v":"-"},null,{"$f":"Tab_IVI_KommunikPer21[[#This Row],[IV-I_Funktionen]]","v":"Kommunikation Innen/Außen_9"},502,{"$f":"IF(ROW(C502)-ROW(C$467)+1>COUNT(Tab_IVI_KommunikPer21[IV-I_Zeile]),\"\",INDEX(F:F,SMALL(Tab_IVI_KommunikPer21[IV-I_Zeile],1+ROW(F502)-ROW($F$467))))","v":"Kommunikation Innen/Außen_9"}]
[307,null,{"$f":"B_IV_Vermarktungs_Konzept!$T13","v":"Pressearbeit_1"},{"$f":"B_IV_Vermarktungs_Konzept!U13","v":"-"},null,{"$f":"Tab_IVI_KommunikPer21[[#This Row],[IV-I_Funktionen]]","v":"Pressearbeit_1"},503,{"$f":"IF(ROW(C503)-ROW(C$467)+1>COUNT(Tab_IVI_KommunikPer21[IV-I_Zeile]),\"\",INDEX(F:F,SMALL(Tab_IVI_KommunikPer21[IV-I_Zeile],1+ROW(F503)-ROW($F$467))))","v":"Pressearbeit_1"}]
[308,null,{"$f":"B_IV_Vermarktungs_Konzept!$T14","v":"Pressearbeit_2"},{"$f":"B_IV_Vermarktungs_Konzept!U14","v":"-"},null,{"$f":"Tab_IVI_KommunikPer21[[#This Row],[IV-I_Funktionen]]","v":"Pressearbeit_2"},504,{"$f":"IF(ROW(C504)-ROW(C$467)+1>COUNT(Tab_IVI_KommunikPer21[IV-I_Zeile]),\"\",INDEX(F:F,SMALL(Tab_IVI_KommunikPer21[IV-I_Zeile],1+ROW(F504)-ROW($F$467))))","v":"Pressearbeit_2"}]
[309,null,{"$f":"B_IV_Vermarktungs_Konzept!$T15","v":"Pressearbeit_3"},{"$f":"B_IV_Vermarktungs_Konzept!U15","v":"-"},null,{"$f":"Tab_IVI_KommunikPer21[[#This Row],[IV-I_Funktionen]]","v":"Pressearbeit_3"},505,{"$f":"IF(ROW(C505)-ROW(C$467)+1>COUNT(Tab_IVI_KommunikPer21[IV-I_Zeile]),\"\",INDEX(F:F,SMALL(Tab_IVI_KommunikPer21[IV-I_Zeile],1+ROW(F505)-ROW($F$467))))","v":"Pressearbeit_3"}]
[310,null,{"$f":"B_IV_Vermarktungs_Konzept!$T16","v":"Pressearbeit_4"},{"$f":"B_IV_Vermarktungs_Konzept!U16","v":"-"},null,{"$f":"Tab_IVI_KommunikPer21[[#This Row],[IV-I_Funktionen]]","v":"Pressearbeit_4"},506,{"$f":"IF(ROW(C506)-ROW(C$467)+1>COUNT(Tab_IVI_KommunikPer21[IV-I_Zeile]),\"\",INDEX(F:F,SMALL(Tab_IVI_KommunikPer21[IV-I_Zeile],1+ROW(F506)-ROW($F$467))))","v":"Pressearbeit_4"}]
[311,null,{"$f":"B_IV_Vermarktungs_Konzept!$T17","v":"Pressearbeit_5"},{"$f":"B_IV_Vermarktungs_Konzept!U17","v":"-"},null,{"$f":"Tab_IVI_KommunikPer21[[#This Row],[IV-I_Funktionen]]","v":"Pressearbeit_5"},507,{"$f":"IF(ROW(C507)-ROW(C$467)+1>COUNT(Tab_IVI_KommunikPer21[IV-I_Zeile]),\"\",INDEX(F:F,SMALL(Tab_IVI_KommunikPer21[IV-I_Zeile],1+ROW(F507)-ROW($F$467))))","v":"Pressearbeit_5"}]
[312,null,{"$f":"B_IV_Vermarktungs_Konzept!$T18","v":"Pressearbeit_6"},{"$f":"B_IV_Vermarktungs_Konzept!U18","v":"-"},null,{"$f":"Tab_IVI_KommunikPer21[[#This Row],[IV-I_Funktionen]]","v":"Pressearbeit_6"},508,{"$f":"IF(ROW(C508)-ROW(C$467)+1>COUNT(Tab_IVI_KommunikPer21[IV-I_Zeile]),\"\",INDEX(F:F,SMALL(Tab_IVI_KommunikPer21[IV-I_Zeile],1+ROW(F508)-ROW($F$467))))","v":"Pressearbeit_6"}]
[313,null,{"$f":"B_IV_Vermarktungs_Konzept!$T19","v":"Pressearbeit_7"},{"$f":"B_IV_Vermarktungs_Konzept!U19","v":"-"},null,{"$f":"Tab_IVI_KommunikPer21[[#This Row],[IV-I_Funktionen]]","v":"Pressearbeit_7"},509,{"$f":"IF(ROW(C509)-ROW(C$467)+1>COUNT(Tab_IVI_KommunikPer21[IV-I_Zeile]),\"\",INDEX(F:F,SMALL(Tab_IVI_KommunikPer21[IV-I_Zeile],1+ROW(F509)-ROW($F$467))))","v":"Pressearbeit_7"}]
[314,null,{"$f":"B_IV_Vermarktungs_Konzept!$T20","v":"Pressearbeit_8"},{"$f":"B_IV_Vermarktungs_Konzept!U20","v":"-"},null,{"$f":"Tab_IVI_KommunikPer21[[#This Row],[IV-I_Funktionen]]","v":"Pressearbeit_8"},510,{"$f":"IF(ROW(C510)-ROW(C$467)+1>COUNT(Tab_IVI_KommunikPer21[IV-I_Zeile]),\"\",INDEX(F:F,SMALL(Tab_IVI_KommunikPer21[IV-I_Zeile],1+ROW(F510)-ROW($F$467))))","v":"Pressearbeit_8"}]
[315,null,{"$f":"B_IV_Vermarktungs_Konzept!$T21","v":"Pressearbeit_9"},{"$f":"B_IV_Vermarktungs_Konzept!U21","v":"-"},null,{"$f":"Tab_IVI_KommunikPer21[[#This Row],[IV-I_Funktionen]]","v":"Pressearbeit_9"},511,{"$f":"IF(ROW(C511)-ROW(C$467)+1>COUNT(Tab_IVI_KommunikPer21[IV-I_Zeile]),\"\",INDEX(F:F,SMALL(Tab_IVI_KommunikPer21[IV-I_Zeile],1+ROW(F511)-ROW($F$467))))","v":"Pressearbeit_9"}]
[]
["L_Nr.","IV. Vermarktungskonzept","IV-J_Funktionen","IV-J_Werte","IV-J_100%","IV-J_Funktion","IV-J_Zeile","IV-J_noch möglich"]
[316,{"$f":"B_IV_Vermarktungs_Konzept!$B$7","v":"J. Marketingperspektive"},{"$f":"B_IV_Vermarktungs_Konzept!$L24","v":"Wo steht der Verein"},{"$f":"B_IV_Vermarktungs_Konzept!M24","v":"-"},null,{"$f":"Tab_IVJ_MarketingPer22[[#This Row],[IV-J_Funktionen]]","v":"Wo steht der Verein"},{"$f":"IF(COUNTIF($C$139:$C$153,F514)>=1,\"\",ROW())","v":514},{"$f":"IF(ROW(C514)-ROW(C$514)+1>COUNT(Tab_IVJ_MarketingPer22[IV-J_Zeile]),\"\",INDEX(F:F,SMALL(Tab_IVJ_MarketingPer22[IV-J_Zeile],1+ROW(F514)-ROW($F$514))))","v":"Wo steht der Verein"}]
[317,null,{"$f":"B_IV_Vermarktungs_Konzept!$L25","v":"Wohin will der Verein"},{"$f":"B_IV_Vermarktungs_Konzept!M25","v":"-"},null,{"$f":"Tab_IVJ_MarketingPer22[[#This Row],[IV-J_Funktionen]]","v":"Wohin will der Verein"},515,{"$f":"IF(ROW(C515)-ROW(C$514)+1>COUNT(Tab_IVJ_MarketingPer22[IV-J_Zeile]),\"\",INDEX(F:F,SMALL(Tab_IVJ_MarketingPer22[IV-J_Zeile],1+ROW(F515)-ROW($F$514))))","v":"Wohin will der Verein"}]
[318,null,{"$f":"B_IV_Vermarktungs_Konzept!$L26","v":"Wie kommt man dort hin"},{"$f":"B_IV_Vermarktungs_Konzept!M26","v":"-"},null,{"$f":"Tab_IVJ_MarketingPer22[[#This Row],[IV-J_Funktionen]]","v":"Wie kommt man dort hin"},516,{"$f":"IF(ROW(C516)-ROW(C$514)+1>COUNT(Tab_IVJ_MarketingPer22[IV-J_Zeile]),\"\",INDEX(F:F,SMALL(Tab_IVJ_MarketingPer22[IV-J_Zeile],1+ROW(F516)-ROW($F$514))))","v":"Wie kommt man dort hin"}]
[319,null,{"$f":"B_IV_Vermarktungs_Konzept!$L27","v":"Welche Mittel stehen zur Verfügung"},{"$f":"B_IV_Vermarktungs_Konzept!M27","v":"-"},null,{"$f":"Tab_IVJ_MarketingPer22[[#This Row],[IV-J_Funktionen]]","v":"Welche Mittel stehen zur Verfügung"},517,{"$f":"IF(ROW(C517)-ROW(C$514)+1>COUNT(Tab_IVJ_MarketingPer22[IV-J_Zeile]),\"\",INDEX(F:F,SMALL(Tab_IVJ_MarketingPer22[IV-J_Zeile],1+ROW(F517)-ROW($F$514))))","v":"Welche Mittel stehen zur Verfügung"}]
[320,null,{"$f":"B_IV_Vermarktungs_Konzept!$L28","v":"Wie sieht der Plan/Konzept aus"},{"$f":"B_IV_Vermarktungs_Konzept!M28","v":"-"},null,{"$f":"Tab_IVJ_MarketingPer22[[#This Row],[IV-J_Funktionen]]","v":"Wie sieht der Plan/Konzept aus"},518,{"$f":"IF(ROW(C518)-ROW(C$514)+1>COUNT(Tab_IVJ_MarketingPer22[IV-J_Zeile]),\"\",INDEX(F:F,SMALL(Tab_IVJ_MarketingPer22[IV-J_Zeile],1+ROW(F518)-ROW($F$514))))","v":"Wie sieht der Plan/Konzept aus"}]
[321,null,{"$f":"B_IV_Vermarktungs_Konzept!$L29","v":"Umsetzung des Plans/Konzeptes"},{"$f":"B_IV_Vermarktungs_Konzept!M29","v":"-"},null,{"$f":"Tab_IVJ_MarketingPer22[[#This Row],[IV-J_Funktionen]]","v":"Umsetzung des Plans/Konzeptes"},519,{"$f":"IF(ROW(C519)-ROW(C$514)+1>COUNT(Tab_IVJ_MarketingPer22[IV-J_Zeile]),\"\",INDEX(F:F,SMALL(Tab_IVJ_MarketingPer22[IV-J_Zeile],1+ROW(F519)-ROW($F$514))))","v":"Umsetzung des Plans/Konzeptes"}]
[322,null,{"$f":"B_IV_Vermarktungs_Konzept!$L30","v":"Kontrollen während der Umsetzung"},{"$f":"B_IV_Vermarktungs_Konzept!M30","v":"-"},null,{"$f":"Tab_IVJ_MarketingPer22[[#This Row],[IV-J_Funktionen]]","v":"Kontrollen während der Umsetzung"},520,{"$f":"IF(ROW(C520)-ROW(C$514)+1>COUNT(Tab_IVJ_MarketingPer22[IV-J_Zeile]),\"\",INDEX(F:F,SMALL(Tab_IVJ_MarketingPer22[IV-J_Zeile],1+ROW(F520)-ROW($F$514))))","v":"Kontrollen während der Umsetzung"}]
[323,null,{"$f":"B_IV_Vermarktungs_Konzept!$L31","v":"Evaluierung am Ende des Zyklus"},{"$f":"B_IV_Vermarktungs_Konzept!M31","v":"-"},null,{"$f":"Tab_IVJ_MarketingPer22[[#This Row],[IV-J_Funktionen]]","v":"Evaluierung am Ende des Zyklus"},521,{"$f":"IF(ROW(C521)-ROW(C$514)+1>COUNT(Tab_IVJ_MarketingPer22[IV-J_Zeile]),\"\",INDEX(F:F,SMALL(Tab_IVJ_MarketingPer22[IV-J_Zeile],1+ROW(F521)-ROW($F$514))))","v":"Evaluierung am Ende des Zyklus"}]
[324,null,{"$f":"B_IV_Vermarktungs_Konzept!$L32","v":"Ergebnisse als Basis des nächsten Zyklus"},{"$f":"B_IV_Vermarktungs_Konzept!M32","v":"-"},null,{"$f":"Tab_IVJ_MarketingPer22[[#This Row],[IV-J_Funktionen]]","v":"Ergebnisse als Basis des nächsten Zyklus"},522,{"$f":"IF(ROW(C522)-ROW(C$514)+1>COUNT(Tab_IVJ_MarketingPer22[IV-J_Zeile]),\"\",INDEX(F:F,SMALL(Tab_IVJ_MarketingPer22[IV-J_Zeile],1+ROW(F522)-ROW($F$514))))","v":"Ergebnisse als Basis des nächsten Zyklus"}]
[325,null,{"$f":"B_IV_Vermarktungs_Konzept!$N24","v":"Marketingabteilung vorhanden"},{"$f":"B_IV_Vermarktungs_Konzept!O24","v":"-"},null,{"$f":"Tab_IVJ_MarketingPer22[[#This Row],[IV-J_Funktionen]]","v":"Marketingabteilung vorhanden"},523,{"$f":"IF(ROW(C523)-ROW(C$514)+1>COUNT(Tab_IVJ_MarketingPer22[IV-J_Zeile]),\"\",INDEX(F:F,SMALL(Tab_IVJ_MarketingPer22[IV-J_Zeile],1+ROW(F523)-ROW($F$514))))","v":"Marketingabteilung vorhanden"}]
[326,null,{"$f":"B_IV_Vermarktungs_Konzept!$N25","v":"Online Marketing Maßnahmen aktuell"},{"$f":"B_IV_Vermarktungs_Konzept!O25","v":"-"},null,{"$f":"Tab_IVJ_MarketingPer22[[#This Row],[IV-J_Funktionen]]","v":"Online Marketing Maßnahmen aktuell"},524,{"$f":"IF(ROW(C524)-ROW(C$514)+1>COUNT(Tab_IVJ_MarketingPer22[IV-J_Zeile]),\"\",INDEX(F:F,SMALL(Tab_IVJ_MarketingPer22[IV-J_Zeile],1+ROW(F524)-ROW($F$514))))","v":"Online Marketing Maßnahmen aktuell"}]
[327,null,{"$f":"B_IV_Vermarktungs_Konzept!$N26","v":"Online Marketing Ziele"},{"$f":"B_IV_Vermarktungs_Konzept!O26","v":"-"},null,{"$f":"Tab_IVJ_MarketingPer22[[#This Row],[IV-J_Funktionen]]","v":"Online Marketing Ziele"},525,{"$f":"IF(ROW(C525)-ROW(C$514)+1>COUNT(Tab_IVJ_MarketingPer22[IV-J_Zeile]),\"\",INDEX(F:F,SMALL(Tab_IVJ_MarketingPer22[IV-J_Zeile],1+ROW(F525)-ROW($F$514))))","v":"Online Marketing Ziele"}]
[328,null,{"$f":"B_IV_Vermarktungs_Konzept!$N27","v":"Vereins(Marken)-Bekanntheit"},{"$f":"B_IV_Vermarktungs_Konzept!O27","v":"-"},null,{"$f":"Tab_IVJ_MarketingPer22[[#This Row],[IV-J_Funktionen]]","v":"Vereins(Marken)-Bekanntheit"},526,{"$f":"IF(ROW(C526)-ROW(C$514)+1>COUNT(Tab_IVJ_MarketingPer22[IV-J_Zeile]),\"\",INDEX(F:F,SMALL(Tab_IVJ_MarketingPer22[IV-J_Zeile],1+ROW(F526)-ROW($F$514))))","v":"Vereins(Marken)-Bekanntheit"}]
[329,null,{"$f":"B_IV_Vermarktungs_Konzept!$N28","v":"Außendarstellung, Werte vermitteln"},{"$f":"B_IV_Vermarktungs_Konzept!O28","v":"-"},null,{"$f":"Tab_IVJ_MarketingPer22[[#This Row],[IV-J_Funktionen]]","v":"Außendarstellung, Werte vermitteln"},527,{"$f":"IF(ROW(C527)-ROW(C$514)+1>COUNT(Tab_IVJ_MarketingPer22[IV-J_Zeile]),\"\",INDEX(F:F,SMALL(Tab_IVJ_MarketingPer22[IV-J_Zeile],1+ROW(F527)-ROW($F$514))))","v":"Außendarstellung, Werte vermitteln"}]
[330,null,{"$f":"B_IV_Vermarktungs_Konzept!$N29","v":"CM-Zielgruppe definieren"},{"$f":"B_IV_Vermarktungs_Konzept!O29","v":"-"},null,{"$f":"Tab_IVJ_MarketingPer22[[#This Row],[IV-J_Funktionen]]","v":"CM-Zielgruppe definieren"},528,{"$f":"IF(ROW(C528)-ROW(C$514)+1>COUNT(Tab_IVJ_MarketingPer22[IV-J_Zeile]),\"\",INDEX(F:F,SMALL(Tab_IVJ_MarketingPer22[IV-J_Zeile],1+ROW(F528)-ROW($F$514))))","v":"CM-Zielgruppe definieren"}]
[331,null,{"$f":"B_IV_Vermarktungs_Konzept!$N30","v":"CM-Leistungesangebot definieren"},{"$f":"B_IV_Vermarktungs_Konzept!O30","v":"-"},null,{"$f":"Tab_IVJ_MarketingPer22[[#This Row],[IV-J_Funktionen]]","v":"CM-Leistungesangebot definieren"},529,{"$f":"IF(ROW(C529)-ROW(C$514)+1>COUNT(Tab_IVJ_MarketingPer22[IV-J_Zeile]),\"\",INDEX(F:F,SMALL(Tab_IVJ_MarketingPer22[IV-J_Zeile],1+ROW(F529)-ROW($F$514))))","v":"CM-Leistungesangebot definieren"}]
[332,null,{"$f":"B_IV_Vermarktungs_Konzept!$N31","v":"CM- Evaluieren"},{"$f":"B_IV_Vermarktungs_Konzept!O31","v":"-"},null,{"$f":"Tab_IVJ_MarketingPer22[[#This Row],[IV-J_Funktionen]]","v":"CM- Evaluieren"},530,{"$f":"IF(ROW(C530)-ROW(C$514)+1>COUNT(Tab_IVJ_MarketingPer22[IV-J_Zeile]),\"\",INDEX(F:F,SMALL(Tab_IVJ_MarketingPer22[IV-J_Zeile],1+ROW(F530)-ROW($F$514))))","v":"CM- Evaluieren"}]
[333,null,{"$f":"B_IV_Vermarktungs_Konzept!$N32","v":"CM-Zielgruppe u. Angebot erweitern"},{"$f":"B_IV_Vermarktungs_Konzept!O32","v":"-"},null,{"$f":"Tab_IVJ_MarketingPer22[[#This Row],[IV-J_Funktionen]]","v":"CM-Zielgruppe u. Angebot erweitern"},531,{"$f":"IF(ROW(C531)-ROW(C$514)+1>COUNT(Tab_IVJ_MarketingPer22[IV-J_Zeile]),\"\",INDEX(F:F,SMALL(Tab_IVJ_MarketingPer22[IV-J_Zeile],1+ROW(F531)-ROW($F$514))))","v":"CM-Zielgruppe u. Angebot erweitern"}]
[334,null,{"$f":"B_IV_Vermarktungs_Konzept!$P24","v":"SOLL/IST Vergleich"},{"$f":"B_IV_Vermarktungs_Konzept!Q24","v":"-"},null,{"$f":"Tab_IVJ_MarketingPer22[[#This Row],[IV-J_Funktionen]]","v":"SOLL/IST Vergleich"},532,{"$f":"IF(ROW(C532)-ROW(C$514)+1>COUNT(Tab_IVJ_MarketingPer22[IV-J_Zeile]),\"\",INDEX(F:F,SMALL(Tab_IVJ_MarketingPer22[IV-J_Zeile],1+ROW(F532)-ROW($F$514))))","v":"SOLL/IST Vergleich"}]
[335,null,{"$f":"B_IV_Vermarktungs_Konzept!$P25","v":"Infrastruktur"},{"$f":"B_IV_Vermarktungs_Konzept!Q25","v":"-"},null,{"$f":"Tab_IVJ_MarketingPer22[[#This Row],[IV-J_Funktionen]]","v":"Infrastruktur"},533,{"$f":"IF(ROW(C533)-ROW(C$514)+1>COUNT(Tab_IVJ_MarketingPer22[IV-J_Zeile]),\"\",INDEX(F:F,SMALL(Tab_IVJ_MarketingPer22[IV-J_Zeile],1+ROW(F533)-ROW($F$514))))","v":"Infrastruktur"}]
[336,null,{"$f":"B_IV_Vermarktungs_Konzept!$P26","v":"Verein allgemein"},{"$f":"B_IV_Vermarktungs_Konzept!Q26","v":"-"},null,{"$f":"Tab_IVJ_MarketingPer22[[#This Row],[IV-J_Funktionen]]","v":"Verein allgemein"},534,{"$f":"IF(ROW(C534)-ROW(C$514)+1>COUNT(Tab_IVJ_MarketingPer22[IV-J_Zeile]),\"\",INDEX(F:F,SMALL(Tab_IVJ_MarketingPer22[IV-J_Zeile],1+ROW(F534)-ROW($F$514))))","v":"Verein allgemein"}]
[337,null,{"$f":"B_IV_Vermarktungs_Konzept!$P27","v":"Kleidung, Dressen, "},{"$f":"B_IV_Vermarktungs_Konzept!Q27","v":"-"},null,{"$f":"Tab_IVJ_MarketingPer22[[#This Row],[IV-J_Funktionen]]","v":"Kleidung, Dressen, "},535,{"$f":"IF(ROW(C535)-ROW(C$514)+1>COUNT(Tab_IVJ_MarketingPer22[IV-J_Zeile]),\"\",INDEX(F:F,SMALL(Tab_IVJ_MarketingPer22[IV-J_Zeile],1+ROW(F535)-ROW($F$514))))","v":"Kleidung, Dressen, "}]
[338,null,{"$f":"B_IV_Vermarktungs_Konzept!$P28","v":"Spiel"},{"$f":"B_IV_Vermarktungs_Konzept!Q28","v":"-"},null,{"$f":"Tab_IVJ_MarketingPer22[[#This Row],[IV-J_Funktionen]]","v":"Spiel"},536,{"$f":"IF(ROW(C536)-ROW(C$514)+1>COUNT(Tab_IVJ_MarketingPer22[IV-J_Zeile]),\"\",INDEX(F:F,SMALL(Tab_IVJ_MarketingPer22[IV-J_Zeile],1+ROW(F536)-ROW($F$514))))","v":"Spiel"}]
[339,null,{"$f":"B_IV_Vermarktungs_Konzept!$P29","v":"Heimspiel"},{"$f":"B_IV_Vermarktungs_Konzept!Q29","v":"-"},null,{"$f":"Tab_IVJ_MarketingPer22[[#This Row],[IV-J_Funktionen]]","v":"Heimspiel"},537,{"$f":"IF(ROW(C537)-ROW(C$514)+1>COUNT(Tab_IVJ_MarketingPer22[IV-J_Zeile]),\"\",INDEX(F:F,SMALL(Tab_IVJ_MarketingPer22[IV-J_Zeile],1+ROW(F537)-ROW($F$514))))","v":"Heimspiel"}]
[340,null,{"$f":"B_IV_Vermarktungs_Konzept!$P30","v":"Werbedurchsagen"},{"$f":"B_IV_Vermarktungs_Konzept!Q30","v":"-"},null,{"$f":"Tab_IVJ_MarketingPer22[[#This Row],[IV-J_Funktionen]]","v":"Werbedurchsagen"},538,{"$f":"IF(ROW(C538)-ROW(C$514)+1>COUNT(Tab_IVJ_MarketingPer22[IV-J_Zeile]),\"\",INDEX(F:F,SMALL(Tab_IVJ_MarketingPer22[IV-J_Zeile],1+ROW(F538)-ROW($F$514))))","v":"Werbedurchsagen"}]
[341,null,{"$f":"B_IV_Vermarktungs_Konzept!$P31","v":"Fernsehen, Kantine"},{"$f":"B_IV_Vermarktungs_Konzept!Q31","v":"-"},null,{"$f":"Tab_IVJ_MarketingPer22[[#This Row],[IV-J_Funktionen]]","v":"Fernsehen, Kantine"},539,{"$f":"IF(ROW(C539)-ROW(C$514)+1>COUNT(Tab_IVJ_MarketingPer22[IV-J_Zeile]),\"\",INDEX(F:F,SMALL(Tab_IVJ_MarketingPer22[IV-J_Zeile],1+ROW(F539)-ROW($F$514))))","v":"Fernsehen, Kantine"}]
[342,null,{"$f":"B_IV_Vermarktungs_Konzept!$P32","v":"Soziale Medien (Website, Zeitungen, ...)"},{"$f":"B_IV_Vermarktungs_Konzept!Q32","v":"-"},null,{"$f":"Tab_IVJ_MarketingPer22[[#This Row],[IV-J_Funktionen]]","v":"Soziale Medien (Website, Zeitungen, ...)"},540,{"$f":"IF(ROW(C540)-ROW(C$514)+1>COUNT(Tab_IVJ_MarketingPer22[IV-J_Zeile]),\"\",INDEX(F:F,SMALL(Tab_IVJ_MarketingPer22[IV-J_Zeile],1+ROW(F540)-ROW($F$514))))","v":"Soziale Medien (Website, Zeitungen, ...)"}]
[343,null,{"$f":"B_IV_Vermarktungs_Konzept!$R24","v":"Sponsorenmappe bereits vorhanden"},{"$f":"B_IV_Vermarktungs_Konzept!S24","v":"-"},null,{"$f":"Tab_IVJ_MarketingPer22[[#This Row],[IV-J_Funktionen]]","v":"Sponsorenmappe bereits vorhanden"},541,{"$f":"IF(ROW(C541)-ROW(C$514)+1>COUNT(Tab_IVJ_MarketingPer22[IV-J_Zeile]),\"\",INDEX(F:F,SMALL(Tab_IVJ_MarketingPer22[IV-J_Zeile],1+ROW(F541)-ROW($F$514))))","v":"Sponsorenmappe bereits vorhanden"}]
[344,null,{"$f":"B_IV_Vermarktungs_Konzept!$R25","v":"Grundkonzept erstellt"},{"$f":"B_IV_Vermarktungs_Konzept!S25","v":"-"},null,{"$f":"Tab_IVJ_MarketingPer22[[#This Row],[IV-J_Funktionen]]","v":"Grundkonzept erstellt"},542,{"$f":"IF(ROW(C542)-ROW(C$514)+1>COUNT(Tab_IVJ_MarketingPer22[IV-J_Zeile]),\"\",INDEX(F:F,SMALL(Tab_IVJ_MarketingPer22[IV-J_Zeile],1+ROW(F542)-ROW($F$514))))","v":"Grundkonzept erstellt"}]
[345,null,{"$f":"B_IV_Vermarktungs_Konzept!$R26","v":"Vereinspräsentation"},{"$f":"B_IV_Vermarktungs_Konzept!S26","v":"-"},null,{"$f":"Tab_IVJ_MarketingPer22[[#This Row],[IV-J_Funktionen]]","v":"Vereinspräsentation"},543,{"$f":"IF(ROW(C543)-ROW(C$514)+1>COUNT(Tab_IVJ_MarketingPer22[IV-J_Zeile]),\"\",INDEX(F:F,SMALL(Tab_IVJ_MarketingPer22[IV-J_Zeile],1+ROW(F543)-ROW($F$514))))","v":"Vereinspräsentation"}]
[346,null,{"$f":"B_IV_Vermarktungs_Konzept!$R27","v":"Erwachsenenfußball Sponsorkonzept"},{"$f":"B_IV_Vermarktungs_Konzept!S27","v":"-"},null,{"$f":"Tab_IVJ_MarketingPer22[[#This Row],[IV-J_Funktionen]]","v":"Erwachsenenfußball Sponsorkonzept"},544,{"$f":"IF(ROW(C544)-ROW(C$514)+1>COUNT(Tab_IVJ_MarketingPer22[IV-J_Zeile]),\"\",INDEX(F:F,SMALL(Tab_IVJ_MarketingPer22[IV-J_Zeile],1+ROW(F544)-ROW($F$514))))","v":"Erwachsenenfußball Sponsorkonzept"}]
[347,null,{"$f":"B_IV_Vermarktungs_Konzept!$R28","v":"Nachwuchsfußball Sponsorenkonzept"},{"$f":"B_IV_Vermarktungs_Konzept!S28","v":"-"},null,{"$f":"Tab_IVJ_MarketingPer22[[#This Row],[IV-J_Funktionen]]","v":"Nachwuchsfußball Sponsorenkonzept"},545,{"$f":"IF(ROW(C545)-ROW(C$514)+1>COUNT(Tab_IVJ_MarketingPer22[IV-J_Zeile]),\"\",INDEX(F:F,SMALL(Tab_IVJ_MarketingPer22[IV-J_Zeile],1+ROW(F545)-ROW($F$514))))","v":"Nachwuchsfußball Sponsorenkonzept"}]
[348,null,{"$f":"B_IV_Vermarktungs_Konzept!$R29","v":"Sponsorvarianten, Visionen, Ziele"},{"$f":"B_IV_Vermarktungs_Konzept!S29","v":"-"},null,{"$f":"Tab_IVJ_MarketingPer22[[#This Row],[IV-J_Funktionen]]","v":"Sponsorvarianten, Visionen, Ziele"},546,{"$f":"IF(ROW(C546)-ROW(C$514)+1>COUNT(Tab_IVJ_MarketingPer22[IV-J_Zeile]),\"\",INDEX(F:F,SMALL(Tab_IVJ_MarketingPer22[IV-J_Zeile],1+ROW(F546)-ROW($F$514))))","v":"Sponsorvarianten, Visionen, Ziele"}]
[349,null,{"$f":"B_IV_Vermarktungs_Konzept!$R30","v":"Sponsorendatenliste vorhanden"},{"$f":"B_IV_Vermarktungs_Konzept!S30","v":"-"},null,{"$f":"Tab_IVJ_MarketingPer22[[#This Row],[IV-J_Funktionen]]","v":"Sponsorendatenliste vorhanden"},547,{"$f":"IF(ROW(C547)-ROW(C$514)+1>COUNT(Tab_IVJ_MarketingPer22[IV-J_Zeile]),\"\",INDEX(F:F,SMALL(Tab_IVJ_MarketingPer22[IV-J_Zeile],1+ROW(F547)-ROW($F$514))))","v":"Sponsorendatenliste vorhanden"}]
[350,null,{"$f":"B_IV_Vermarktungs_Konzept!$R31","v":"Schriftliche Verträge"},{"$f":"B_IV_Vermarktungs_Konzept!S31","v":"-"},null,{"$f":"Tab_IVJ_MarketingPer22[[#This Row],[IV-J_Funktionen]]","v":"Schriftliche Verträge"},548,{"$f":"IF(ROW(C548)-ROW(C$514)+1>COUNT(Tab_IVJ_MarketingPer22[IV-J_Zeile]),\"\",INDEX(F:F,SMALL(Tab_IVJ_MarketingPer22[IV-J_Zeile],1+ROW(F548)-ROW($F$514))))","v":"Schriftliche Verträge"}]
[351,null,{"$f":"B_IV_Vermarktungs_Konzept!$R32","v":"Jährliche Bepreisung in Zusatzblatt"},{"$f":"B_IV_Vermarktungs_Konzept!S32","v":"-"},null,{"$f":"Tab_IVJ_MarketingPer22[[#This Row],[IV-J_Funktionen]]","v":"Jährliche Bepreisung in Zusatzblatt"},549,{"$f":"IF(ROW(C549)-ROW(C$514)+1>COUNT(Tab_IVJ_MarketingPer22[IV-J_Zeile]),\"\",INDEX(F:F,SMALL(Tab_IVJ_MarketingPer22[IV-J_Zeile],1+ROW(F549)-ROW($F$514))))","v":"Jährliche Bepreisung in Zusatzblatt"}]
[]
["L_Nr.","V. Nachhaltigkeitskonzept","V-N_Funktionen","V-N_Werte","V-N_100%","V-N_Funktion","V-N_Zeile","V-N_noch möglich"]
[352,{"$f":"B_V_Nachhaltigkeits_Konzept!$B$5","v":"N. Nachhaltigkeitsperspektive"},{"$f":"B_V_Nachhaltigkeits_Konzept!L2","v":"Strom - Test für Strategy Map"},{"$f":"B_V_Nachhaltigkeits_Konzept!M2","v":"-"},null,{"$f":"Tab_IVN_NachhaltigPer23[[#This Row],[V-N_Funktionen]]","v":"Strom - Test für Strategy Map"},{"$f":"IF(COUNTIF($C$155:$C$160,F552)>=1,\"\",ROW())","v":552},{"$f":"IF(ROW(C552)-ROW(C$552)+1>COUNT(Tab_IVN_NachhaltigPer23[V-N_Zeile]),\"\",INDEX(F:F,SMALL(Tab_IVN_NachhaltigPer23[V-N_Zeile],1+ROW(F552)-ROW($F$552))))","v":"Strom - Test für Strategy Map"}]
[353,null,{"$f":"B_V_Nachhaltigkeits_Konzept!L3","v":"Wasser"},{"$f":"B_V_Nachhaltigkeits_Konzept!M3","v":"-"},null,{"$f":"Tab_IVN_NachhaltigPer23[[#This Row],[V-N_Funktionen]]","v":"Wasser"},{"$f":"IF(COUNTIF($C$155:$C$160,F553)>=1,\"\",ROW())","v":553},{"$f":"IF(ROW(C553)-ROW(C$552)+1>COUNT(Tab_IVN_NachhaltigPer23[V-N_Zeile]),\"\",INDEX(F:F,SMALL(Tab_IVN_NachhaltigPer23[V-N_Zeile],1+ROW(F553)-ROW($F$552))))","v":"Wasser"}]
[354,null,{"$f":"B_V_Nachhaltigkeits_Konzept!L4","v":"Gastronomie"},{"$f":"B_V_Nachhaltigkeits_Konzept!M4","v":"-"},null,{"$f":"Tab_IVN_NachhaltigPer23[[#This Row],[V-N_Funktionen]]","v":"Gastronomie"},554,{"$f":"IF(ROW(C554)-ROW(C$552)+1>COUNT(Tab_IVN_NachhaltigPer23[V-N_Zeile]),\"\",INDEX(F:F,SMALL(Tab_IVN_NachhaltigPer23[V-N_Zeile],1+ROW(F554)-ROW($F$552))))","v":"Gastronomie"}]
[355,null,{"$f":"B_V_Nachhaltigkeits_Konzept!L5","v":"Rasen"},{"$f":"B_V_Nachhaltigkeits_Konzept!M5","v":"-"},null,{"$f":"Tab_IVN_NachhaltigPer23[[#This Row],[V-N_Funktionen]]","v":"Rasen"},555,{"$f":"IF(ROW(C555)-ROW(C$552)+1>COUNT(Tab_IVN_NachhaltigPer23[V-N_Zeile]),\"\",INDEX(F:F,SMALL(Tab_IVN_NachhaltigPer23[V-N_Zeile],1+ROW(F555)-ROW($F$552))))","v":"Rasen"}]
[356,null,{"$f":"B_V_Nachhaltigkeits_Konzept!L6","v":"Vereinsgelände"},{"$f":"B_V_Nachhaltigkeits_Konzept!M6","v":"-"},null,{"$f":"Tab_IVN_NachhaltigPer23[[#This Row],[V-N_Funktionen]]","v":"Vereinsgelände"},556,{"$f":"IF(ROW(C556)-ROW(C$552)+1>COUNT(Tab_IVN_NachhaltigPer23[V-N_Zeile]),\"\",INDEX(F:F,SMALL(Tab_IVN_NachhaltigPer23[V-N_Zeile],1+ROW(F556)-ROW($F$552))))","v":"Vereinsgelände"}]
[357,null,{"$f":"B_V_Nachhaltigkeits_Konzept!L7","v":"Veranstaltungen"},{"$f":"B_V_Nachhaltigkeits_Konzept!M7","v":"-"},null,{"$f":"Tab_IVN_NachhaltigPer23[[#This Row],[V-N_Funktionen]]","v":"Veranstaltungen"},557,{"$f":"IF(ROW(C557)-ROW(C$552)+1>COUNT(Tab_IVN_NachhaltigPer23[V-N_Zeile]),\"\",INDEX(F:F,SMALL(Tab_IVN_NachhaltigPer23[V-N_Zeile],1+ROW(F557)-ROW($F$552))))","v":"Veranstaltungen"}]
[358,null,{"$f":"B_V_Nachhaltigkeits_Konzept!L8","v":"Gebäude"},{"$f":"B_V_Nachhaltigkeits_Konzept!M8","v":"-"},null,{"$f":"Tab_IVN_NachhaltigPer23[[#This Row],[V-N_Funktionen]]","v":"Gebäude"},558,{"$f":"IF(ROW(C558)-ROW(C$552)+1>COUNT(Tab_IVN_NachhaltigPer23[V-N_Zeile]),\"\",INDEX(F:F,SMALL(Tab_IVN_NachhaltigPer23[V-N_Zeile],1+ROW(F558)-ROW($F$552))))","v":"Gebäude"}]
[359,null,{"$f":"B_V_Nachhaltigkeits_Konzept!L9","v":"Verwaltung"},{"$f":"B_V_Nachhaltigkeits_Konzept!M9","v":"-"},null,{"$f":"Tab_IVN_NachhaltigPer23[[#This Row],[V-N_Funktionen]]","v":"Verwaltung"},559,{"$f":"IF(ROW(C559)-ROW(C$552)+1>COUNT(Tab_IVN_NachhaltigPer23[V-N_Zeile]),\"\",INDEX(F:F,SMALL(Tab_IVN_NachhaltigPer23[V-N_Zeile],1+ROW(F559)-ROW($F$552))))","v":"Verwaltung"}]
[360,null,{"$f":"B_V_Nachhaltigkeits_Konzept!L10","v":"Test"},{"$f":"B_V_Nachhaltigkeits_Konzept!M10","v":"-"},null,{"$f":"Tab_IVN_NachhaltigPer23[[#This Row],[V-N_Funktionen]]","v":"Test"},560,{"$f":"IF(ROW(C560)-ROW(C$552)+1>COUNT(Tab_IVN_NachhaltigPer23[V-N_Zeile]),\"\",INDEX(F:F,SMALL(Tab_IVN_NachhaltigPer23[V-N_Zeile],1+ROW(F560)-ROW($F$552))))","v":"Test"}]

{"sheet":"Benchmark \"Future Eleven\" ","index":5,"n_rows":15,"n_cols":10,"rows_kept":15,"cut":false,"hidden":false,"merged":[[14,2,14,3],[5,2,5,3],[6,2,6,3],[7,2,7,3],[8,2,8,3],[9,2,9,3],[10,2,10,3],[11,2,11,3],[0,0,0,2],[12,2,12,3],[13,2,13,3],[3,2,3,3],[2,2,2,3],[0,3,0,6],[1,5,1,6],[1,3,1,4],[4,2,4,3]]}
["Benchmark \"Future Eleven\"",null,null,{"$f":"B_Konzept!$E$1","v":"Union TTI St. Florian"},null,null,null,null,null," "]
[null,null,null,"Konzept",null,"Die Ebenen"]
["BEREICH","KENNUNG","BEZEICHNUNG",null,"% IST","% Diff","% SOLL"]
["Gesamt","BGes1",{"$f":"B_Konzept!$B$4","v":"Eingeführte Konzepte"},null,{"$f":"B_Konzept!E2","v":0.99},{"$f":"G4-E4","v":1.0000000000000009E-2},1]
[{"$f":"B_I_Entw_Konzept!B2","v":"I. Entwicklungskonzept"},"BEnt1",{"$f":"B_I_Entw_Konzept!P2","v":"BEnt1 - Vereinsstrategie"},null,{"$f":"IF(B_Konzept!$C$5=\"-\",\"-\",B_I_Entw_Konzept!Q2)","v":0.99},{"$f":"IF(E5=\"-\",\"-\",G5-E5)","v":1.0000000000000009E-2},{"$f":"IF(E5=\"-\",\"-\",100%)","v":1}]
[{"$f":"B_II_Verw_Konzept!B2","v":"II. Verwaltungskonzept"},"BVer1",{"$f":"'B_II_D_D1_Unterstützer FinanzP'!B5","v":"BVer1 - Sponsorenanteil am Budget steigt"},null,{"$f":"IF(B_Konzept!$C$6=\"-\",\"-\",B_II_Verw_Konzept!M13)","v":"-"},{"$f":"IF(E6=\"-\",\"-\",G6-E6)","v":"-"},{"$f":"IF(E6=\"-\",\"-\",100%)","v":"-"}]
[null,"BVer2",{"$f":"'B_II_D_D2_Sport FinanzP'!B5","v":"BVer2 - Spieltagsumsatz steigt"},null,{"$f":"IF(B_Konzept!$C$6=\"-\",\"-\",B_II_Verw_Konzept!M14)","v":"-"},{"$f":"IF(E7=\"-\",\"-\",G7-E7)","v":"-"},{"$f":"IF(E7=\"-\",\"-\",100%)","v":"-"}]
[null,"BVer3",{"$f":"'B_II_D_D1_Unterstützer FinanzP'!B6","v":"BVer3 - Zahlungsüberschuss (Cash Flow) steigt"},null,{"$f":"IF(B_Konzept!$C$6=\"-\",\"-\",B_II_Verw_Konzept!O13)","v":"-"},"-","-"]
[{"$f":"B_III_Sport_Konzept!B2","v":"III. Sportkonzept"},"BSpo1",{"$f":"B_III_F_F1_SpP_Vereinssportleit!$B$5","v":"BSpo1 - Ausbildungsstand der Trainer erhöhen"},null,{"$f":"IF(B_Konzept!$C$7=\"-\",\"-\",B_III_Sport_Konzept!M13)","v":"-"},{"$f":"IF(E9=\"-\",\"-\",G9-E9)","v":"-"},{"$f":"IF(E9=\"-\",\"-\",100%)","v":"-"}]
[null,"BSpo2",{"$f":"B_III_F_F1_SpP_Vereinssportleit!$B$6","v":"BSpo2 - Quantität der NW-Spieler wird erhöht"},null,{"$f":"IF(B_Konzept!$C$7=\"-\",\"-\",B_III_Sport_Konzept!M14)","v":"-"},{"$f":"IF(E10=\"-\",\"-\",G10-E10)","v":"-"},{"$f":"IF(E10=\"-\",\"-\",100%)","v":"-"}]
[null,"BSpo3",{"$f":"B_III_F_F1_SpP_Vereinssportleit!$B$7","v":"BSpo3 - Anteil der Eigenbauspieler in KM steigt"},null,{"$f":"IF(B_Konzept!$C$7=\"-\",\"-\",B_III_Sport_Konzept!M15)","v":"-"},"-","-"]
[null,"BSpo4",{"$f":"B_III_F_F1_SpP_Vereinssportleit!$B$8","v":"BSpo4 - Sportlicher Erfolg der KM steigt"},null,{"$f":"IF(B_Konzept!$C$7=\"-\",\"-\",B_III_Sport_Konzept!M16)","v":"-"},"-",{"$f":"IF(E12=\"-\",\"-\",100%)","v":"-"}]
[{"$f":"B_IV_Vermarktungs_Konzept!B2","v":"IV. Vermarktungskonzept"},"BMar1",{"$f":"'B_IV_H_H5_Benchmark Verm'!B5","v":"BMar1 - Mitgliederzahlen steigen"},null,{"$f":"IF(B_Konzept!$C$8=\"-\",\"-\",B_IV_Vermarktungs_Konzept!U2)","v":"-"},{"$f":"IF(E13=\"-\",\"-\",G13-E13)","v":"-"},{"$f":"IF(E13=\"-\",\"-\",100%)","v":"-"}]
[null,"BMar2",{"$f":"'B_IV_H_H5_Benchmark Verm'!B6","v":"BMar2 - Anteil Freiwilligenarbeit steigt"},null,{"$f":"IF(B_Konzept!$C$8=\"-\",\"-\",B_IV_Vermarktungs_Konzept!U3)","v":"-"},{"$f":"IF(E14=\"-\",\"-\",G14-E14)","v":"-"},{"$f":"IF(E14=\"-\",\"-\",100%)","v":"-"}]
[null,"BMar3",{"$f":"'B_IV_H_H5_Benchmark Verm'!B7","v":"BMar3 - Ausschöpfung Marketingkanäle"},null,{"$f":"IF(B_Konzept!$C$8=\"-\",\"-\",B_IV_Vermarktungs_Konzept!U4)","v":"-"},"-","-"]

{"sheet":"B_Konzept","index":6,"n_rows":10,"n_cols":9,"rows_kept":10,"cut":false,"hidden":false,"merged":[[0,4,0,6],[2,1,2,2],[1,1,1,2],[0,1,0,3],[3,1,3,2],[3,5,3,6],[3,3,3,4]]}
[null,"Strategy Map - Verein 4.0",null,null,"Union TTI St. Florian"]
[null,"Konzepte",null,10000,{"$f":"E3/D2","v":0.99},{"$f":"IFERROR(D2/G2,0)","v":10000},{"$f":"COUNTIF($C$5:$C$10,1)","v":1}]
[null,"Eingeführte Konzepte",null,"Punkte",{"$f":"SUM(D5:D10)","v":9900},"SOLL","IST"]
[null,"Eingeführte Konzepte",null,"Benchmark \"Future Eleven\"",null,"Die Ebenen"]
[1,{"$f":"B_I_Entw_Konzept!B2","v":"I. Entwicklungskonzept"},1,{"$f":"IF(C5=\"-\",\"-\",IFERROR(($D$2/COUNTIF($C$5:$C$10,\">0\")*(H5/F5)),\"-\"))","v":9900},{"$f":"IF(C5=1,D5,\"-\")","v":9900},{"$f":"IF(C5=\"-\",\"-\",100%)","v":1},{"$f":"IF(C5=1,B_I_Entw_Konzept!E2,\"-\")","v":0.99},{"$f":"IF(C5=1,G5,\"-\")","v":0.99},{"$f":"IFERROR($F$2*C5,0)","v":10000}]
[2,{"$f":"B_II_Verw_Konzept!B2","v":"II. Verwaltungskonzept"},"-","-",{"$f":"IF(C6=1,D6,\"-\")","v":"-"},"-",{"$f":"IF(C6=1,B_II_Verw_Konzept!E2,\"-\")","v":"-"},{"$f":"IF(C6=1,G6,\"-\")","v":"-"},0]
[3,{"$f":"B_III_Sport_Konzept!B2","v":"III. Sportkonzept"},"-","-","-","-",{"$f":"IF(C7=1,B_III_Sport_Konzept!E2,\"-\")","v":"-"},"-",{"$f":"IFERROR($F$2*C7,0)","v":0}]
[4,{"$f":"B_IV_Vermarktungs_Konzept!B2","v":"IV. Vermarktungskonzept"},"-","-","-","-",{"$f":"IF(C8=1,B_IV_Vermarktungs_Konzept!E2,\"-\")","v":"-"},"-",0]
[5,{"$f":"B_V_Nachhaltigkeits_Konzept!B2","v":"V. Nachhaltigkeitskonzept"},"-","-","-","-",{"$f":"IF(C9=1,B_V_Nachhaltigkeits_Konzept!E2,\"-\")","v":"-"},"-",0]
[6," ","-","-","-","-",null,"-",{"$f":"IFERROR($F$2*C10,0)","v":0}]

{"sheet":"B_I_Entw_Konzept","index":7,"n_rows":21,"n_cols":19,"rows_kept":21,"cut":false,"hidden":false,"merged":[[0,4,0,6],[1,1,1,2],[2,1,2,2],[0,1,0,3],[3,1,3,2],[3,5,3,6]]}
[null,"Strategy Map - Verein 4.0",null,null,{"$f":"B_Konzept!$E$1","v":"Union TTI St. Florian"},null,null,null,null,null,{"$f":"$B$5","v":"A. Vereinsperspektive"},{"$f":"B_I_A_VereinsPersp!B5","v":"A1. Vereinsleitbild"},null,{"$f":"B_I_A_VereinsPersp!B6","v":"A2. Ziele"},null,{"$f":"B_I_A_VereinsPersp!B7","v":"A3. Strategie"},null,{"$f":"B_I_A_VereinsPersp!B8","v":"A4. Aktionsplan"}]
[null,"I. Entwicklungskonzept",null,{"$f":"B_Konzept!I5","v":10000},{"$f":"IFERROR(E3/D2,0)","v":0.99},{"$f":"IFERROR(D2/G2,0)","v":10000},{"$f":"COUNTIF($C$5:$C$8,1)","v":1},null,null,null,null,{"$f":"B_I_A_A1_VP_Leitbild!B5","v":"Leitideen"},{"$f":"IF($D$2>0,IF($C$5=\"-\",\"-\",B_I_A_A1_VP_Leitbild!H5),\"-\")","v":"-"},{"$f":"B_I_A_A2_VP_Ziele!B5","v":"Sportliche Ziele"},{"$f":"IF($D$2>0,IF($C$5=\"-\",\"-\",B_I_A_A2_VP_Ziele!H5),\"-\")","v":"-"},{"$f":"B_I_A_A3_VP_Strategie!B5","v":"BEnt1 - Vereinsstrategie"},{"$f":"IF($D$2>0,IF($C$5=\"-\",\"-\",B_I_A_A3_VP_Strategie!H5),\"-\")","v":0.99},{"$f":"B_I_A_A4_VP_Aktionsplan!B5","v":"Sportliche Aktonsplan"},{"$f":"IF($D$2>0,IF($C$5=\"-\",\"-\",B_I_A_A4_VP_Aktionsplan!H5),\"-\")","v":"-"}]
[null,"Entwicklungskonzepte",null,"Punkte",{"$f":"SUM(D5:D7)","v":9900},"SOLL","IST",null,null,null,null,{"$f":"B_I_A_A1_VP_Leitbild!B6","v":"Sinn und Zweck"},{"$f":"IF($D$2>0,IF($C$5=\"-\",\"-\",B_I_A_A1_VP_Leitbild!H6),\"-\")","v":"-"},{"$f":"B_I_A_A2_VP_Ziele!B6","v":"Wirtschaftliche Ziele"},{"$f":"IF($D$2>0,IF($C$5=\"-\",\"-\",B_I_A_A2_VP_Ziele!H6),\"-\")","v":"-"},{"$f":"B_I_A_A3_VP_Strategie!B6","v":"Wirtschaftliche Strategien"},{"$f":"IF($D$2>0,IF($C$5=\"-\",\"-\",B_I_A_A3_VP_Strategie!H6),\"-\")","v":"-"},{"$f":"B_I_A_A4_VP_Aktionsplan!B6","v":"Wirtschaftliche Aktionsplan"},{"$f":"IF($D$2>0,IF($C$5=\"-\",\"-\",B_I_A_A4_VP_Aktionsplan!H6),\"-\")","v":"-"}]
[null,null,null,"Konzept",null,"Die Ebenen",null,null,null,null,null,{"$f":"B_I_A_A1_VP_Leitbild!B7","v":"Nutzen für Mitglieder und Gesellschaft"},{"$f":"IF($D$2>0,IF($C$5=\"-\",\"-\",B_I_A_A1_VP_Leitbild!H7),\"-\")","v":"-"},{"$f":"B_I_A_A2_VP_Ziele!B7","v":"Gesellschaftliche Ziele"},{"$f":"IF($D$2>0,IF($C$5=\"-\",\"-\",B_I_A_A2_VP_Ziele!H7),\"-\")","v":"-"},{"$f":"B_I_A_A3_VP_Strategie!B7","v":"Gesellschaftliche Strategien"},{"$f":"IF($D$2>0,IF($C$5=\"-\",\"-\",B_I_A_A3_VP_Strategie!H7),\"-\")","v":"-"},{"$f":"B_I_A_A4_VP_Aktionsplan!B7","v":"Gesellschaftliche Aktionsplan"},{"$f":"IF($D$2>0,IF($C$5=\"-\",\"-\",B_I_A_A4_VP_Aktionsplan!H7),\"-\")","v":"-"}]
[1,{"$f":"B_I_A_VereinsPersp!B4","v":"A. Vereinsperspektive"},1,{"$f":"IF(C5=\"-\",\"-\",IFERROR(($D$2/COUNTIF($C$5:$C$7,\">0\")*(H5/F5)),\"-\"))","v":9900},{"$f":"D5","v":9900},{"$f":"IF(C5=\"-\",\"-\",\"100%\")","v":"100%"},{"$f":"IF(C5=1,B_I_A_VereinsPersp!E2,\"-\")","v":0.99},{"$f":"IF(C5=1,G5,\"-\")","v":0.99},{"$f":"IFERROR($F$2*C5,0)","v":10000},null,null,{"$f":"B_I_A_A1_VP_Leitbild!B8","v":"Normen"},{"$f":"IF($D$2>0,IF($C$5=\"-\",\"-\",B_I_A_A1_VP_Leitbild!H8),\"-\")","v":"-"},{"$f":"B_I_A_A2_VP_Ziele!B8","v":"A2_Ziele 4"},{"$f":"IF($D$2>0,IF($C$5=\"-\",\"-\",B_I_A_A2_VP_Ziele!H8),\"-\")","v":"-"},{"$f":"B_I_A_A3_VP_Strategie!B8","v":"Sportliche Strategien"},{"$f":"IF($D$2>0,IF($C$5=\"-\",\"-\",B_I_A_A3_VP_Strategie!H8),\"-\")","v":"-"},{"$f":"B_I_A_A4_VP_Aktionsplan!B8","v":"A4_Aktionsplan 4"},{"$f":"IF($D$2>0,IF($C$5=\"-\",\"-\",B_I_A_A4_VP_Aktionsplan!H8),\"-\")","v":"-"}]
[2,{"$f":"B_I_B_AusBildungsPersp!B4","v":"B. (Aus)Bildungsperspektive"},"-","-",{"$f":"D6","v":"-"},{"$f":"IF(C6=\"-\",\"-\",\"100%\")","v":"-"},{"$f":"IF(C6=1,B_I_B_AusBildungsPersp!E2,\"-\")","v":"-"},"-",{"$f":"IFERROR($F$2*C6,0)","v":0},null,null,{"$f":"B_I_A_A1_VP_Leitbild!B9","v":"Werte"},{"$f":"IF($D$2>0,IF($C$5=\"-\",\"-\",B_I_A_A1_VP_Leitbild!H9),\"-\")","v":"-"},{"$f":"B_I_A_A2_VP_Ziele!B9","v":"A2_Ziele 5"},{"$f":"IF($D$2>0,IF($C$5=\"-\",\"-\",B_I_A_A2_VP_Ziele!H9),\"-\")","v":"-"},{"$f":"B_I_A_A3_VP_Strategie!B9","v":"Nachwuchs Strategien"},{"$f":"IF($D$2>0,IF($C$5=\"-\",\"-\",B_I_A_A3_VP_Strategie!H9),\"-\")","v":"-"},{"$f":"B_I_A_A4_VP_Aktionsplan!B9","v":"A4_Aktionsplan 5"},{"$f":"IF($D$2>0,IF($C$5=\"-\",\"-\",B_I_A_A4_VP_Aktionsplan!H9),\"-\")","v":"-"}]
[3,null,"-","-","-",{"$f":"IF(C7=\"-\",\"-\",\"100%\")","v":"-"},null,"-",0,null,null,{"$f":"B_I_A_A1_VP_Leitbild!B10","v":"Muster"},{"$f":"IF($D$2>0,IF($C$5=\"-\",\"-\",B_I_A_A1_VP_Leitbild!H10),\"-\")","v":"-"},{"$f":"B_I_A_A2_VP_Ziele!B10","v":"A2_Ziele 6"},{"$f":"IF($D$2>0,IF($C$5=\"-\",\"-\",B_I_A_A2_VP_Ziele!H10),\"-\")","v":"-"},{"$f":"B_I_A_A3_VP_Strategie!B10","v":"Veranstaltung"},{"$f":"IF($D$2>0,IF($C$5=\"-\",\"-\",B_I_A_A3_VP_Strategie!H10),\"-\")","v":"-"},{"$f":"B_I_A_A4_VP_Aktionsplan!B10","v":"A4_Aktionsplan 6"},{"$f":"IF($D$2>0,IF($C$5=\"-\",\"-\",B_I_A_A4_VP_Aktionsplan!H10),\"-\")","v":"-"}]
[4,null,"-",{"$f":"IF(C8=\"-\",\"-\",IFERROR(($D$2/COUNTIF($C$5:$C$7,\">0\")*(H8/F8)),\"-\"))","v":"-"},{"$f":"D8","v":"-"},"-",null,"-",0,null,null,{"$f":"B_I_A_A1_VP_Leitbild!B11","v":"Mission"},{"$f":"IF($D$2>0,IF($C$5=\"-\",\"-\",B_I_A_A1_VP_Leitbild!H11),\"-\")","v":"-"},{"$f":"B_I_A_A2_VP_Ziele!B11","v":"A2_Ziele 7"},{"$f":"IF($D$2>0,IF($C$5=\"-\",\"-\",B_I_A_A2_VP_Ziele!H11),\"-\")","v":"-"},{"$f":"B_I_A_A3_VP_Strategie!B11","v":"A3_Strategie 7"},{"$f":"IF($D$2>0,IF($C$5=\"-\",\"-\",B_I_A_A3_VP_Strategie!H11),\"-\")","v":"-"},{"$f":"B_I_A_A4_VP_Aktionsplan!B11","v":"A4_Aktionsplan 7"},{"$f":"IF($D$2>0,IF($C$5=\"-\",\"-\",B_I_A_A4_VP_Aktionsplan!H11),\"-\")","v":"-"}]
[null,null,null,null,null,null,null,null,null,null,null,{"$f":"B_I_A_A1_VP_Leitbild!B12","v":"Visionen"},{"$f":"IF($D$2>0,IF($C$5=\"-\",\"-\",B_I_A_A1_VP_Leitbild!H12),\"-\")","v":"-"},{"$f":"B_I_A_A2_VP_Ziele!B12","v":"A2_Ziele 8"},{"$f":"IF($D$2>0,IF($C$5=\"-\",\"-\",B_I_A_A2_VP_Ziele!H12),\"-\")","v":"-"},{"$f":"B_I_A_A3_VP_Strategie!B12","v":"A3_Strategie 8"},{"$f":"IF($D$2>0,IF($C$5=\"-\",\"-\",B_I_A_A3_VP_Strategie!H12),\"-\")","v":"-"},{"$f":"B_I_A_A4_VP_Aktionsplan!B12","v":"A4_Aktionsplan 8"},{"$f":"IF($D$2>0,IF($C$5=\"-\",\"-\",B_I_A_A4_VP_Aktionsplan!H12),\"-\")","v":"-"}]
[null,null,null,null,null,null,null,null,null,null,null,{"$f":"B_I_A_A1_VP_Leitbild!B13","v":"Leitsätze"},{"$f":"IF($D$2>0,IF($C$5=\"-\",\"-\",B_I_A_A1_VP_Leitbild!H13),\"-\")","v":"-"},{"$f":"B_I_A_A2_VP_Ziele!B13","v":"A2_Ziele 9"},{"$f":"IF($D$2>0,IF($C$5=\"-\",\"-\",B_I_A_A2_VP_Ziele!H13),\"-\")","v":"-"},{"$f":"B_I_A_A3_VP_Strategie!B13","v":"A3_Strategie 9"},{"$f":"IF($D$2>0,IF($C$5=\"-\",\"-\",B_I_A_A3_VP_Strategie!H13),\"-\")","v":"-"},{"$f":"B_I_A_A4_VP_Aktionsplan!B13","v":"A4_Aktionsplan 9"},{"$f":"IF($D$2>0,IF($C$5=\"-\",\"-\",B_I_A_A4_VP_Aktionsplan!H13),\"-\")","v":"-"}]
[]
[null,null,null,null,null,null,null,null,null,null,{"$f":"$B$6","v":"B. (Aus)Bildungsperspektive"},{"$f":"B_I_B_AusBildungsPersp!B5","v":"B1. KnowHow der Funktionäre"},null,{"$f":"B_I_B_AusBildungsPersp!B6","v":"B2. Verwaltungs Funktionäre"},null,{"$f":"B_I_B_AusBildungsPersp!B7","v":"B3. Sport Funktionäre"},null,{"$f":"B_I_B_AusBildungsPersp!B8","v":"B4. Vermarktungs Funktionäre"}]
[null,null,null,null,null,null,null,null,null,null,null,{"$f":"B_I_B_B1_ABP_KnowHow_Funk!B5","v":"Kompetenzen Know How Fkt."},{"$f":"IF($D$2>0,IF($C$6=\"-\",\"-\",B_I_B_B1_ABP_KnowHow_Funk!H5),\"-\")","v":"-"},{"$f":"B_I_B_B2_ABP_VerwaltungsFunk!B5","v":"Kompetenzen Verwaltungsfunktionär"},{"$f":"IF($D$2>0,IF($C$6=\"-\",\"-\",B_I_B_B2_ABP_VerwaltungsFunk!H5),\"-\")","v":"-"},{"$f":"B_I_B_B3_ABP_SportFun!B5","v":"Kompetenzen Sportfunktionär"},{"$f":"IF($D$2>0,IF($C$6=\"-\",\"-\",B_I_B_B3_ABP_SportFun!H5),\"-\")","v":"-"},{"$f":"B_I_B_B4_ABP_VermarktungsFun!B5","v":"Kompetenzen Vermarktungsfunktionär"},{"$f":"IF($D$2>0,IF($C$6=\"-\",\"-\",B_I_B_B4_ABP_VermarktungsFun!H5),\"-\")","v":"-"}]
[null,null,null,null,null,null,null,null,null,null,null,{"$f":"B_I_B_B1_ABP_KnowHow_Funk!B6","v":"Fachwissen Know How Fkt."},{"$f":"IF($D$2>0,IF($C$6=\"-\",\"-\",B_I_B_B1_ABP_KnowHow_Funk!H6),\"-\")","v":"-"},{"$f":"B_I_B_B2_ABP_VerwaltungsFunk!B6","v":"Fachwissen  Verwaltungsfunktionär"},{"$f":"IF($D$2>0,IF($C$6=\"-\",\"-\",B_I_B_B2_ABP_VerwaltungsFunk!H6),\"-\")","v":"-"},{"$f":"B_I_B_B3_ABP_SportFun!B6","v":"Fachwissen Sportfunktionär"},{"$f":"IF($D$2>0,IF($C$6=\"-\",\"-\",B_I_B_B3_ABP_SportFun!H6),\"-\")","v":"-"},{"$f":"B_I_B_B4_ABP_VermarktungsFun!B6","v":"Fachwissen Vermarktungsfunktionär"},{"$f":"IF($D$2>0,IF($C$6=\"-\",\"-\",B_I_B_B4_ABP_VermarktungsFun!H6),\"-\")","v":"-"}]
[null,null,null,null,null,null,null,null,null,null,null,{"$f":"B_I_B_B1_ABP_KnowHow_Funk!B7","v":"Berufliche Fähigkeiten Fkt."},{"$f":"IF($D$2>0,IF($C$6=\"-\",\"-\",B_I_B_B1_ABP_KnowHow_Funk!H7),\"-\")","v":"-"},{"$f":"B_I_B_B2_ABP_VerwaltungsFunk!B7","v":"Berufliche Fähigkeiten  Verw.Funktionär"},{"$f":"IF($D$2>0,IF($C$6=\"-\",\"-\",B_I_B_B2_ABP_VerwaltungsFunk!H7),\"-\")","v":"-"},{"$f":"B_I_B_B3_ABP_SportFun!B7","v":"Berufliche Fähigkeiten Sportfunktionär"},{"$f":"IF($D$2>0,IF($C$6=\"-\",\"-\",B_I_B_B3_ABP_SportFun!H7),\"-\")","v":"-"},{"$f":"B_I_B_B4_ABP_VermarktungsFun!B7","v":"Berufliche Fähigkeiten Verm.Funktionär"},{"$f":"IF($D$2>0,IF($C$6=\"-\",\"-\",B_I_B_B4_ABP_VermarktungsFun!H7),\"-\")","v":"-"}]
[null,null,null,null,null,null,null,null,null,null,null,{"$f":"B_I_B_B1_ABP_KnowHow_Funk!B8","v":"Soziale Kompetenz Fkt."},{"$f":"IF($D$2>0,IF($C$6=\"-\",\"-\",B_I_B_B1_ABP_KnowHow_Funk!H8),\"-\")","v":"-"},{"$f":"B_I_B_B2_ABP_VerwaltungsFunk!B8","v":"Soziale Kompetenz Verw_Fkt."},{"$f":"IF($D$2>0,IF($C$6=\"-\",\"-\",B_I_B_B2_ABP_VerwaltungsFunk!H8),\"-\")","v":"-"},{"$f":"B_I_B_B3_ABP_SportFun!B8","v":"Soziale Kompetenz Sp_Fkt."},{"$f":"IF($D$2>0,IF($C$6=\"-\",\"-\",B_I_B_B3_ABP_SportFun!H8),\"-\")","v":"-"},{"$f":"B_I_B_B4_ABP_VermarktungsFun!B8","v":"Soziale Kompetenz  Vermarktungsfunktionär"},{"$f":"IF($D$2>0,IF($C$6=\"-\",\"-\",B_I_B_B4_ABP_VermarktungsFun!H8),\"-\")","v":"-"}]
[null,null,null,null,null,null,null,null,null,null,null,{"$f":"B_I_B_B1_ABP_KnowHow_Funk!B9","v":"Weiterbildung Fkt."},{"$f":"IF($D$2>0,IF($C$6=\"-\",\"-\",B_I_B_B1_ABP_KnowHow_Funk!H9),\"-\")","v":"-"},{"$f":"B_I_B_B2_ABP_VerwaltungsFunk!B9","v":"Weiterbildung Verw_Fkt."},{"$f":"IF($D$2>0,IF($C$6=\"-\",\"-\",B_I_B_B2_ABP_VerwaltungsFunk!H9),\"-\")","v":"-"},{"$f":"B_I_B_B3_ABP_SportFun!B9","v":"Weiterbildung Sp_Fkt."},{"$f":"IF($D$2>0,IF($C$6=\"-\",\"-\",B_I_B_B3_ABP_SportFun!H9),\"-\")","v":"-"},{"$f":"B_I_B_B4_ABP_VermarktungsFun!B9","v":"Weiterbildung Vermarktungsfunktionär"},{"$f":"IF($D$2>0,IF($C$6=\"-\",\"-\",B_I_B_B4_ABP_VermarktungsFun!H9),\"-\")","v":"-"}]
[null,null,null,null,null,null,null,null,null,null,null,{"$f":"B_I_B_B1_ABP_KnowHow_Funk!B10","v":"Standing in der Region Fkt."},{"$f":"IF($D$2>0,IF($C$6=\"-\",\"-\",B_I_B_B1_ABP_KnowHow_Funk!H10),\"-\")","v":"-"},{"$f":"B_I_B_B2_ABP_VerwaltungsFunk!B10","v":"Standing in der Region Verw_Fkt."},{"$f":"IF($D$2>0,IF($C$6=\"-\",\"-\",B_I_B_B2_ABP_VerwaltungsFunk!H10),\"-\")","v":"-"},{"$f":"B_I_B_B3_ABP_SportFun!B10","v":"Standing in der Region Sp_Fkt."},{"$f":"IF($D$2>0,IF($C$6=\"-\",\"-\",B_I_B_B3_ABP_SportFun!H10),\"-\")","v":"-"},{"$f":"B_I_B_B4_ABP_VermarktungsFun!B10","v":"Standing in der Region Verm_Fkt."},{"$f":"IF($D$2>0,IF($C$6=\"-\",\"-\",B_I_B_B4_ABP_VermarktungsFun!H10),\"-\")","v":"-"}]
[null,null,null,null,null,null,null,null,null,null,null,{"$f":"B_I_B_B1_ABP_KnowHow_Funk!B11","v":"Zeitliche Ressourcen Fkt."},{"$f":"IF($D$2>0,IF($C$6=\"-\",\"-\",B_I_B_B1_ABP_KnowHow_Funk!H11),\"-\")","v":"-"},{"$f":"B_I_B_B2_ABP_VerwaltungsFunk!B11","v":"Zeitliche Ressourcen Verw_Fkt."},{"$f":"IF($D$2>0,IF($C$6=\"-\",\"-\",B_I_B_B2_ABP_VerwaltungsFunk!H11),\"-\")","v":"-"},{"$f":"B_I_B_B3_ABP_SportFun!B11","v":"Zeitliche Ressourcen Sp_Fkt."},{"$f":"IF($D$2>0,IF($C$6=\"-\",\"-\",B_I_B_B3_ABP_SportFun!H11),\"-\")","v":"-"},{"$f":"B_I_B_B4_ABP_VermarktungsFun!B11","v":"Zeitliche Ressourcen Verm_Fkt."},{"$f":"IF($D$2>0,IF($C$6=\"-\",\"-\",B_I_B_B4_ABP_VermarktungsFun!H11),\"-\")","v":"-"}]
[null,null,null,null,null,null,null,null,null,null,null,{"$f":"B_I_B_B1_ABP_KnowHow_Funk!B12","v":"Identifikation Fkt."},{"$f":"IF($D$2>0,IF($C$6=\"-\",\"-\",B_I_B_B1_ABP_KnowHow_Funk!H12),\"-\")","v":"-"},{"$f":"B_I_B_B2_ABP_VerwaltungsFunk!B12","v":"Identifikation Verw_Fkt."},{"$f":"IF($D$2>0,IF($C$6=\"-\",\"-\",B_I_B_B2_ABP_VerwaltungsFunk!H12),\"-\")","v":"-"},{"$f":"B_I_B_B3_ABP_SportFun!B12","v":"Identifikation Sp_Fkt."},{"$f":"IF($D$2>0,IF($C$6=\"-\",\"-\",B_I_B_B3_ABP_SportFun!H12),\"-\")","v":"-"},{"$f":"B_I_B_B4_ABP_VermarktungsFun!B12","v":"Identifikation Verm_Fkt."},{"$f":"IF($D$2>0,IF($C$6=\"-\",\"-\",B_I_B_B4_ABP_VermarktungsFun!H12),\"-\")","v":"-"}]
[null,null,null,null,null,null,null,null,null,null,null,{"$f":"B_I_B_B1_ABP_KnowHow_Funk!B13","v":"Muster_1 Fkt."},{"$f":"IF($D$2>0,IF($C$6=\"-\",\"-\",B_I_B_B1_ABP_KnowHow_Funk!H13),\"-\")","v":"-"},{"$f":"B_I_B_B2_ABP_VerwaltungsFunk!B13","v":"Test-Muster_2 Verw_Fkt."},{"$f":"IF($D$2>0,IF($C$6=\"-\",\"-\",B_I_B_B2_ABP_VerwaltungsFunk!H13),\"-\")","v":"-"},{"$f":"B_I_B_B3_ABP_SportFun!B13","v":"Test-Muster_3 Sp_Fkt."},{"$f":"IF($D$2>0,IF($C$6=\"-\",\"-\",B_I_B_B3_ABP_SportFun!H13),\"-\")","v":"-"},{"$f":"B_I_B_B4_ABP_VermarktungsFun!B13","v":"Test Verm_Fkt."},{"$f":"IF($D$2>0,IF($C$6=\"-\",\"-\",B_I_B_B4_ABP_VermarktungsFun!H13),\"-\")","v":"-"}]

{"sheet":"B_I_A_VereinsPersp","index":8,"n_rows":8,"n_cols":9,"rows_kept":8,"cut":false,"hidden":false,"merged":[[2,1,2,2],[1,1,1,2],[3,1,3,2],[0,1,0,3],[0,4,0,6],[3,5,3,6]]}
[null,"Strategy Map - Verein 4.0",null,null,{"$f":"B_Konzept!$E$1","v":"Union TTI St. Florian"}]
[null,"I. Entwicklungskonzept",null,{"$f":"B_I_Entw_Konzept!I5","v":10000},{"$f":"IFERROR(E3/D2,0)","v":0.99},{"$f":"IFERROR(D2/G2,0)","v":10000},{"$f":"COUNTIF($C$5:$C$8,1)","v":1}]
[null,"Entwicklungskonzepte",null,"Punkte",{"$f":"SUM(D5:D8)","v":9900},"SOLL","IST"]
[null,"A. Vereinsperspektive",null,"Konzept",null,"Die Ebenen"]
[1,{"$f":"B_I_A_A1_VP_Leitbild!B4","v":"A1. Vereinsleitbild"},"-",{"$f":"IF(C5=\"-\",\"-\",IFERROR(($D$2/COUNTIF($C$5:$C$8,\">0\")*(H5/F5)),\"-\"))","v":"-"},{"$f":"D5","v":"-"},{"$f":"IF(C5=\"-\",\"-\",\"100%\")","v":"-"},{"$f":"IF(C5=1,B_I_A_A1_VP_Leitbild!E2,\"-\")","v":"-"},{"$f":"IF(C5=1,G5,\"-\")","v":"-"},{"$f":"IFERROR($F$2*C5,0)","v":0}]
[2,{"$f":"B_I_A_A2_VP_Ziele!B4","v":"A2. Ziele"},"-",{"$f":"IF(C6=\"-\",\"-\",IFERROR(($D$2/COUNTIF($C$5:$C$8,\">0\")*(H6/F6)),\"-\"))","v":"-"},{"$f":"D6","v":"-"},{"$f":"IF(C6=\"-\",\"-\",\"100%\")","v":"-"},{"$f":"IF(C6=1,B_I_A_A2_VP_Ziele!E2,\"-\")","v":"-"},{"$f":"IF(C6=1,G6,\"-\")","v":"-"},{"$f":"IFERROR($F$2*C6,0)","v":0}]
[3,{"$f":"B_I_A_A3_VP_Strategie!B4","v":"A3. Strategie"},1,9900,9900,{"$f":"IF(C7=\"-\",\"-\",\"100%\")","v":"100%"},{"$f":"IF(C7=1,B_I_A_A3_VP_Strategie!E2,\"-\")","v":0.99},0.99,10000]
[4,{"$f":"B_I_A_A4_VP_Aktionsplan!B4","v":"A4. Aktionsplan"},"-","-","-",{"$f":"IF(C8=\"-\",\"-\",\"100%\")","v":"-"},{"$f":"IF(C8=1,B_I_A_A4_VP_Aktionsplan!E2,\"-\")","v":"-"},"-",0]

{"sheet":"B_I_A_A1_VP_Leitbild","index":9,"n_rows":13,"n_cols":8,"rows_kept":13,"cut":false,"hidden":true,"merged":[[1,1,1,2],[2,1,2,2],[0,1,0,3],[0,4,0,6],[3,1,3,2],[3,5,3,6]]}
[null,"Strategy Map - Verein 4.0",null,null,{"$f":"B_Konzept!$E$1","v":"Union TTI St. Florian"}]
[null,"I. Entwicklungskonzept",null,{"$f":"B_I_A_VereinsPersp!I5","v":0},{"$f":"IFERROR(E3/D2,0)","v":0},{"$f":"IFERROR(D2/G2,0)","v":0},{"$f":"COUNTIF($C$5:$C$13,1)","v":9}]
[null,"A. Vereinsperspektiven",null,"Punkte",{"$f":"SUM(D5:D13)","v":0},"SOLL","IST"]
[null,"A1. Vereinsleitbild",null,"Konzept",null,"Die Ebenen"]
[1,"Leitideen",1,{"$f":"IF(C5=\"-\",0,IFERROR(($D$2/COUNTIF($C$5:$C$13,\">0\")*(H5/F5)),0))","v":0},{"$f":"IF(C5=1,D5,\"-\")","v":0},{"$f":"IF(C5=\"-\",\"-\",\"100%\")","v":"100%"},0.9,{"$f":"IF($D$2=0,\"-\",IF(C5=1,G5,\"-\"))","v":"-"}]
[2,"Sinn und Zweck",1,0,{"$f":"IF(C6=1,D6,\"-\")","v":0},"100%",0.91,{"$f":"IF($D$2=0,\"-\",IF(C6=1,G6,\"-\"))","v":"-"}]
[3,"Nutzen für Mitglieder und Gesellschaft",1,{"$f":"IF(C7=\"-\",0,IFERROR(($D$2/COUNTIF($C$5:$C$13,\">0\")*(H7/F7)),0))","v":0},0,{"$f":"IF(C7=\"-\",\"-\",\"100%\")","v":"100%"},0.92,"-"]
[4,"Normen",1,{"$f":"IF(C8=\"-\",0,IFERROR(($D$2/COUNTIF($C$5:$C$13,\">0\")*(H8/F8)),0))","v":0},0,{"$f":"IF(C8=\"-\",\"-\",\"100%\")","v":"100%"},0.93,"-"]
[5,"Werte",1,0,0,"100%",0.94,"-"]
[6,"Muster",1,0,0,"100%",0.95,"-"]
[7,"Mission",1,0,{"$f":"IF(C11=1,D11,\"-\")","v":0},"100%",0.96,"-"]
[8,"Visionen",1,0,{"$f":"IF(C12=1,D12,\"-\")","v":0},"100%",0.97,"-"]
[9,"Leitsätze",1,0,0,"100%",0.98,"-"]

{"sheet":"B_I_A_A2_VP_Ziele","index":10,"n_rows":13,"n_cols":8,"rows_kept":13,"cut":false,"hidden":true,"merged":[[0,1,0,3],[0,4,0,6],[1,1,1,2],[2,1,2,2],[3,1,3,2],[3,5,3,6]]}
[null,"Strategy Map - Verein 4.0",null,null,{"$f":"B_Konzept!$E$1","v":"Union TTI St. Florian"}]
[null,"I. Entwicklungskonzept",null,{"$f":"B_I_A_VereinsPersp!I6","v":0},{"$f":"IFERROR(E3/D2,0)","v":0},{"$f":"IFERROR(D2/G2,0)","v":0},{"$f":"COUNTIF($C$5:$C$13,1)","v":9}]
[null,"A. Vereinsperspektiven",null,"Punkte",{"$f":"SUM(D5:D13)","v":0},"SOLL","IST"]
[null,"A2. Ziele",null,"Konzept",null,"Die Ebenen"]
[1,"Sportliche Ziele",1,{"$f":"IF(C5=\"-\",0,IFERROR(($D$2/COUNTIF($C$5:$C$13,\">0\")*(H5/F5)),0))","v":0},{"$f":"IF(C5=1,D5,\"-\")","v":0},{"$f":"IF(C5=\"-\",\"-\",\"100%\")","v":"100%"},0.8,{"$f":"IF($D$2=0,\"-\",IF(C5=1,G5,\"-\"))","v":"-"}]
[2,"Wirtschaftliche Ziele",1,0,{"$f":"IF(C6=1,D6,\"-\")","v":0},{"$f":"IF(C6=\"-\",\"-\",\"100%\")","v":"100%"},0.81,{"$f":"IF($D$2=0,\"-\",IF(C6=1,G6,\"-\"))","v":"-"}]
[3,"Gesellschaftliche Ziele",1,{"$f":"IF(C7=\"-\",0,IFERROR(($D$2/COUNTIF($C$5:$C$13,\">0\")*(H7/F7)),0))","v":0},0,"100%",0.82,"-"]
[4,"A2_Ziele 4",1,{"$f":"IF(C8=\"-\",0,IFERROR(($D$2/COUNTIF($C$5:$C$13,\">0\")*(H8/F8)),0))","v":0},0,{"$f":"IF(C8=\"-\",\"-\",\"100%\")","v":"100%"},0.83,"-"]
[5,"A2_Ziele 5",1,0,0,{"$f":"IF(C9=\"-\",\"-\",\"100%\")","v":"100%"},0.84,"-"]
[6,"A2_Ziele 6",1,0,0,"100%",0.85,"-"]
[7,"A2_Ziele 7",1,0,{"$f":"IF(C11=1,D11,\"-\")","v":0},"100%",0.86,"-"]
[8,"A2_Ziele 8",1,0,{"$f":"IF(C12=1,D12,\"-\")","v":0},"100%",0.869999999999999,"-"]
[9,"A2_Ziele 9",1,0,0,"100%",0.88,"-"]

{"sheet":"B_I_A_A3_VP_Strategie","index":11,"n_rows":13,"n_cols":8,"rows_kept":13,"cut":false,"hidden":false,"merged":[[0,1,0,3],[0,4,0,6],[1,1,1,2],[2,1,2,2],[3,1,3,2],[3,5,3,6]]}
[null,"Strategy Map - Verein 4.0",null,null,{"$f":"B_Konzept!$E$1","v":"Union TTI St. Florian"}]
[null,"I. Entwicklungskonzept",null,{"$f":"B_I_A_VereinsPersp!I7","v":10000},{"$f":"IFERROR(E3/D2,0)","v":0.99},{"$f":"IFERROR(D2/G2,0)","v":10000},{"$f":"COUNTIF($C$5:$C$5,1)","v":1}]
[null,"A. Vereinsperspektiven",null,"Punkte",{"$f":"SUM(D5:D5)","v":9900},"SOLL","IST"]
[null,"A3. Strategie",null,"Konzept","Richtwerte","Die Ebenen"]
[1,"BEnt1 - Vereinsstrategie",1,{"$f":"IF(C5=\"-\",0,IFERROR(($D$2/COUNTIF($C$5:$C$5,\">0\")*(H5/F5)),0))","v":9900},{"$f":"IF(C5=1,D5,\"-\")","v":9900},{"$f":"IF(C5=\"-\",\"-\",\"100%\")","v":"100%"},0.99,{"$f":"IF($D$2=0,\"-\",IF(C5=1,G5,\"-\"))","v":0.99}]
[2,"Wirtschaftliche Strategien","-",{"$f":"IF(C6=\"-\",0,IFERROR(($D$2/COUNTIF($C$5:$C$13,\">0\")*(H6/F6)),0))","v":0},"-","-",0,{"$f":"IF($D$2=0,\"-\",IF(C6=1,G6,\"-\"))","v":"-"}]
[3,"Gesellschaftliche Strategien","-",{"$f":"IF(C7=\"-\",0,IFERROR(($D$2/COUNTIF($C$5:$C$13,\">0\")*(H7/F7)),0))","v":0},"-","-",0,"-"]
[4,"Sportliche Strategien","-",{"$f":"IF(C8=\"-\",0,IFERROR(($D$2/COUNTIF($C$5:$C$13,\">0\")*(H8/F8)),0))","v":0},"-",{"$f":"IF(C8=\"-\",\"-\",\"100%\")","v":"-"},0,"-"]
[5,"Nachwuchs Strategien","-",0,"-",{"$f":"IF(C9=\"-\",\"-\",\"100%\")","v":"-"},0,"-"]
[6,"Veranstaltung","-",0,"-","-",0,"-"]
[7,"A3_Strategie 7","-",0,"-","-",0,"-"]
[8,"A3_Strategie 8","-",0,"-","-",0,"-"]
[9,"A3_Strategie 9","-",0,"-","-",0,"-"]

{"sheet":"B_I_A_A4_VP_Aktionsplan","index":12,"n_rows":13,"n_cols":8,"rows_kept":13,"cut":false,"hidden":true,"merged":[[0,1,0,3],[0,4,0,6],[1,1,1,2],[2,1,2,2],[3,1,3,2],[3,5,3,6]]}
[null,"Strategy Map - Verein 4.0",null,null,{"$f":"B_Konzept!$E$1","v":"Union TTI St. Florian"}]
[null,"I. Entwicklungskonzept",null,{"$f":"B_I_A_VereinsPersp!I8","v":0},{"$f":"IFERROR(E3/D2,0)","v":0},{"$f":"IFERROR(D2/G2,0)","v":0},{"$f":"COUNTIF($C$5:$C$13,1)","v":9}]
[null,"A. Vereinsperspektiven",null,"Punkte",{"$f":"SUM(D5:D13)","v":0},"SOLL","IST"]
[null,"A4. Aktionsplan",null,"Konzept",null,"Die Ebenen"]
[1,"Sportliche Aktonsplan",1,{"$f":"IF(C5=\"-\",0,IFERROR(($D$2/COUNTIF($C$5:$C$13,\">0\")*(H5/F5)),0))","v":0},{"$f":"IF(C5=1,D5,\"-\")","v":0},{"$f":"IF(C5=\"-\",\"-\",\"100%\")","v":"100%"},0.6,{"$f":"IF($D$2=0,\"-\",IF(C5=1,G5,\"-\"))","v":"-"}]
[2,"Wirtschaftliche Aktionsplan",1,{"$f":"IF(C6=\"-\",0,IFERROR(($D$2/COUNTIF($C$5:$C$13,\">0\")*(H6/F6)),0))","v":0},{"$f":"IF(C6=1,D6,\"-\")","v":0},"100%",0.61,{"$f":"IF($D$2=0,\"-\",IF(C6=1,G6,\"-\"))","v":"-"}]
[3,"Gesellschaftliche Aktionsplan",1,{"$f":"IF(C7=\"-\",0,IFERROR(($D$2/COUNTIF($C$5:$C$13,\">0\")*(H7/F7)),0))","v":0},0,"100%",0.62,"-"]
[4,"A4_Aktionsplan 4",1,{"$f":"IF(C8=\"-\",0,IFERROR(($D$2/COUNTIF($C$5:$C$13,\">0\")*(H8/F8)),0))","v":0},0,{"$f":"IF(C8=\"-\",\"-\",\"100%\")","v":"100%"},0.63,"-"]
[5,"A4_Aktionsplan 5",1,0,0,{"$f":"IF(C9=\"-\",\"-\",\"100%\")","v":"100%"},0.64,"-"]
[6,"A4_Aktionsplan 6",1,0,0,"100%",0.65,"-"]
[7,"A4_Aktionsplan 7",1,0,0,"100%",0.66,"-"]
[8,"A4_Aktionsplan 8",1,0,0,"100%",0.67,"-"]
[9,"A4_Aktionsplan 9",1,0,0,"100%",0.68,"-"]

{"sheet":"B_I_B_AusBildungsPersp","index":13,"n_rows":8,"n_cols":9,"rows_kept":8,"cut":false,"hidden":true,"merged":[[0,1,0,3],[0,4,0,6],[1,1,1,2],[2,1,2,2],[3,1,3,2],[3,5,3,6]]}
[null,"Strategy Map - Verein 4.0",null,null,{"$f":"B_Konzept!$E$1","v":"Union TTI St. Florian"}]
[null,"I. Entwicklungskonzept",null,{"$f":"B_I_Entw_Konzept!I6","v":0},{"$f":"IFERROR(E3/D2,0)","v":0},{"$f":"IFERROR(D2/G2,0)","v":0},{"$f":"COUNTIF($C$5:$C$8,1)","v":4}]
[null,"Entwicklungskonzepte",null,"Punkte",{"$f":"SUM(D5:D13)","v":0},"SOLL","IST"]
[null,"B. (Aus)Bildungsperspektive",null,"Konzept",null,"Die Ebenen"]
[1,{"$f":"B_I_B_B1_ABP_KnowHow_Funk!B4","v":"B1. KnowHow der Funktionäre"},1,{"$f":"IF(C5=\"-\",\"-\",IFERROR(($D$2/COUNTIF($C$5:$C$8,\">0\")*(H5/F5)),\"-\"))","v":0},{"$f":"D5","v":0},{"$f":"IF(C5=\"-\",\"-\",\"100%\")","v":"100%"},{"$f":"IF(C5=1,B_I_B_B1_ABP_KnowHow_Funk!E2,\"-\")","v":0},{"$f":"IF(C5=1,G5,\"-\")","v":0},{"$f":"IFERROR($F$2*C5,0)","v":0}]
[2,{"$f":"B_I_B_B2_ABP_VerwaltungsFunk!B4","v":"B2. Verwaltungs Funktionäre"},1,{"$f":"IF(C6=\"-\",\"-\",IFERROR(($D$2/COUNTIF($C$5:$C$8,\">0\")*(H6/F6)),\"-\"))","v":0},{"$f":"D6","v":0},{"$f":"IF(C6=\"-\",\"-\",\"100%\")","v":"100%"},{"$f":"IF(C6=1,B_I_B_B2_ABP_VerwaltungsFunk!E2,\"-\")","v":0},{"$f":"IF(C6=1,G6,\"-\")","v":0},{"$f":"IFERROR($F$2*C6,0)","v":0}]
[3,{"$f":"B_I_B_B3_ABP_SportFun!B4","v":"B3. Sport Funktionäre"},1,{"$f":"IF(C7=\"-\",\"-\",IFERROR(($D$2/COUNTIF($C$5:$C$8,\">0\")*(H7/F7)),\"-\"))","v":0},0,"100%",{"$f":"IF(C7=1,B_I_B_B3_ABP_SportFun!E2,\"-\")","v":0},0,0]
[4,{"$f":"B_I_B_B4_ABP_VermarktungsFun!B4","v":"B4. Vermarktungs Funktionäre"},1,{"$f":"IF(C8=\"-\",\"-\",IFERROR(($D$2/COUNTIF($C$5:$C$8,\">0\")*(H8/F8)),\"-\"))","v":0},0,"100%",{"$f":"IF(C8=1,B_I_B_B4_ABP_VermarktungsFun!E2,\"-\")","v":0},0,0]

{"sheet":"B_I_B_B1_ABP_KnowHow_Funk","index":14,"n_rows":13,"n_cols":8,"rows_kept":13,"cut":false,"hidden":true,"merged":[[1,1,1,2],[2,1,2,2],[3,1,3,2],[0,1,0,3],[0,4,0,6],[3,5,3,6]]}
[null,"Strategy Map - Verein 4.0",null,null,{"$f":"B_Konzept!$E$1","v":"Union TTI St. Florian"}]
[null,"I. Entwicklungskonzept",null,{"$f":"B_I_B_AusBildungsPersp!I5","v":0},{"$f":"IFERROR(E3/D2,0)","v":0},{"$f":"IFERROR(D2/G2,0)","v":0},{"$f":"COUNTIF($C$5:$C$13,1)","v":9}]
[null,"B. (Aus)Bildungsperspektive",null,"Punkte",{"$f":"SUM(D5:D13)","v":0},"SOLL","IST"]
[null,"B1. KnowHow der Funktionäre",null,"Konzept",null,"Die Ebenen"]
[1,"Kompetenzen Know How Fkt.",1,{"$f":"IF(C5=\"-\",0,IFERROR(($D$2/COUNTIF($C$5:$C$13,\">0\")*(H5/F5)),0))","v":0},{"$f":"IF(C5=1,D5,\"-\")","v":0},{"$f":"IF(C5=\"-\",\"-\",\"100%\")","v":"100%"},0.98,{"$f":"IF($D$2=0,\"-\",IF(C5=1,G5,\"-\"))","v":"-"}]
[2,"Fachwissen Know How Fkt.",1,0,0,"100%",0.97,{"$f":"IF($D$2=0,\"-\",IF(C6=1,G6,\"-\"))","v":"-"}]
[3,"Berufliche Fähigkeiten Fkt.",1,0,0,"100%",0.96,"-"]
[4,"Soziale Kompetenz Fkt.",1,0,0,{"$f":"IF(C8=\"-\",\"-\",\"100%\")","v":"100%"},0.95,"-"]
[5,"Weiterbildung Fkt.",1,0,0,{"$f":"IF(C9=\"-\",\"-\",\"100%\")","v":"100%"},0.94,"-"]
[6,"Standing in der Region Fkt.",1,0,0,"100%",0.93,"-"]
[7,"Zeitliche Ressourcen Fkt.",1,0,0,"100%",0.92,"-"]
[8,"Identifikation Fkt.",1,0,0,"100%",0.91,"-"]
[9,"Muster_1 Fkt.",1,0,0,"100%",0.9,"-"]

{"sheet":"B_I_B_B2_ABP_VerwaltungsFunk","index":15,"n_rows":13,"n_cols":8,"rows_kept":13,"cut":false,"hidden":true,"merged":[[1,1,1,2],[2,1,2,2],[3,1,3,2],[0,1,0,3],[0,4,0,6],[3,5,3,6]]}
[null,"Strategy Map - Verein 4.0",null,null,{"$f":"B_Konzept!$E$1","v":"Union TTI St. Florian"}]
[null,"I. Entwicklungskonzept",null,{"$f":"B_I_B_AusBildungsPersp!I6","v":0},{"$f":"IFERROR(E3/D2,0)","v":0},{"$f":"IFERROR(D2/G2,0)","v":0},{"$f":"COUNTIF($C$5:$C$13,1)","v":9}]
[null,"B. (Aus)Bildungsperspektive",null,"Punkte",{"$f":"SUM(D5:D13)","v":0},"SOLL","IST"]
[null,"B2. Verwaltungs Funktionäre",null,"Konzept",null,"Die Ebenen"]
[1,"Kompetenzen Verwaltungsfunktionär",1,{"$f":"IF(C5=\"-\",0,IFERROR(($D$2/COUNTIF($C$5:$C$13,\">0\")*(H5/F5)),0))","v":0},{"$f":"IF(C5=1,D5,\"-\")","v":0},{"$f":"IF(C5=\"-\",\"-\",\"100%\")","v":"100%"},0.88,{"$f":"IF($D$2=0,\"-\",IF(C5=1,G5,\"-\"))","v":"-"}]
[2,"Fachwissen  Verwaltungsfunktionär",1,0,{"$f":"IF(C6=1,D6,\"-\")","v":0},"100%",0.869999999999999,{"$f":"IF($D$2=0,\"-\",IF(C6=1,G6,\"-\"))","v":"-"}]
[3,"Berufliche Fähigkeiten  Verw.Funktionär",1,{"$f":"IF(C7=\"-\",0,IFERROR(($D$2/COUNTIF($C$5:$C$13,\">0\")*(H7/F7)),0))","v":0},0,"100%",0.86,"-"]
[4,"Soziale Kompetenz Verw_Fkt.",1,{"$f":"IF(C8=\"-\",0,IFERROR(($D$2/COUNTIF($C$5:$C$13,\">0\")*(H8/F8)),0))","v":0},0,{"$f":"IF(C8=\"-\",\"-\",\"100%\")","v":"100%"},0.85,"-"]
[5,"Weiterbildung Verw_Fkt.",1,0,0,{"$f":"IF(C9=\"-\",\"-\",\"100%\")","v":"100%"},0.84,"-"]
[6,"Standing in der Region Verw_Fkt.",1,0,0,"100%",0.83,"-"]
[7,"Zeitliche Ressourcen Verw_Fkt.",1,0,{"$f":"IF(C11=1,D11,\"-\")","v":0},"100%",0.82,"-"]
[8,"Identifikation Verw_Fkt.",1,0,{"$f":"IF(C12=1,D12,\"-\")","v":0},"100%",0.81,"-"]
[9,"Test-Muster_2 Verw_Fkt.",1,0,0,"100%",0.8,"-"]

{"sheet":"B_I_B_B3_ABP_SportFun","index":16,"n_rows":13,"n_cols":8,"rows_kept":13,"cut":false,"hidden":true,"merged":[[1,1,1,2],[2,1,2,2],[3,1,3,2],[0,1,0,3],[0,4,0,6],[3,5,3,6]]}
[null,"Strategy Map - Verein 4.0",null,null,{"$f":"B_Konzept!$E$1","v":"Union TTI St. Florian"}]
[null,"I. Entwicklungskonzept",null,{"$f":"B_I_B_AusBildungsPersp!I7","v":0},{"$f":"IFERROR(E3/D2,0)","v":0},{"$f":"IFERROR(D2/G2,0)","v":0},{"$f":"COUNTIF($C$5:$C$13,1)","v":9}]
[null,"B. (Aus)Bildungsperspektive",null,"Punkte",{"$f":"SUM(D5:D13)","v":0},"SOLL","IST"]
[null,"B3. Sport Funktionäre",null,"Konzept",null,"Die Ebenen"]
[1,"Kompetenzen Sportfunktionär",1,{"$f":"IF(C5=\"-\",0,IFERROR(($D$2/COUNTIF($C$5:$C$13,\">0\")*(H5/F5)),0))","v":0},{"$f":"IF(C5=1,D5,\"-\")","v":0},{"$f":"IF(C5=\"-\",\"-\",\"100%\")","v":"100%"},0.78,{"$f":"IF($D$2=0,\"-\",IF(C5=1,G5,\"-\"))","v":"-"}]
[2,"Fachwissen Sportfunktionär",1,0,0,"100%",0.77,{"$f":"IF($D$2=0,\"-\",IF(C6=1,G6,\"-\"))","v":"-"}]
[3,"Berufliche Fähigkeiten Sportfunktionär",1,{"$f":"IF(C7=\"-\",0,IFERROR(($D$2/COUNTIF($C$5:$C$13,\">0\")*(H7/F7)),0))","v":0},0,"100%",0.76,"-"]
[4,"Soziale Kompetenz Sp_Fkt.",1,{"$f":"IF(C8=\"-\",0,IFERROR(($D$2/COUNTIF($C$5:$C$13,\">0\")*(H8/F8)),0))","v":0},0,{"$f":"IF(C8=\"-\",\"-\",\"100%\")","v":"100%"},0.75,"-"]
[5,"Weiterbildung Sp_Fkt.",1,0,0,{"$f":"IF(C9=\"-\",\"-\",\"100%\")","v":"100%"},0.74,"-"]
[6,"Standing in der Region Sp_Fkt.",1,0,0,"100%",0.73,"-"]
[7,"Zeitliche Ressourcen Sp_Fkt.",1,0,0,"100%",0.72,"-"]
[8,"Identifikation Sp_Fkt.",1,0,0,"100%",0.71,"-"]
[9,"Test-Muster_3 Sp_Fkt.",1,0,0,"100%",0.7,"-"]

{"sheet":"B_I_B_B4_ABP_VermarktungsFun","index":17,"n_rows":13,"n_cols":8,"rows_kept":13,"cut":false,"hidden":true,"merged":[[1,1,1,2],[2,1,2,2],[3,1,3,2],[0,1,0,3],[0,4,0,6],[3,5,3,6]]}
[null,"Strategy Map - Verein 4.0",null,null,{"$f":"B_Konzept!$E$1","v":"Union TTI St. Florian"}]
[null,"I. Entwicklungskonzept",null,{"$f":"B_I_B_AusBildungsPersp!I8","v":0},{"$f":"IFERROR(E3/D2,0)","v":0},{"$f":"IFERROR(D2/G2,0)","v":0},{"$f":"COUNTIF($C$5:$C$13,1)","v":9}]
[null,"B. (Aus)Bildungsperspektive",null,"Punkte",{"$f":"SUM(D5:D13)","v":0},"SOLL","IST"]
[null,"B4. Vermarktungs Funktionäre",null,"Konzept",null,"Die Ebenen"]
[1,"Kompetenzen Vermarktungsfunktionär",1,{"$f":"IF(C5=\"-\",0,IFERROR(($D$2/COUNTIF($C$5:$C$13,\">0\")*(H5/F5)),0))","v":0},{"$f":"IF(C5=1,D5,\"-\")","v":0},{"$f":"IF(C5=\"-\",\"-\",\"100%\")","v":"100%"},0.68,{"$f":"IF($D$2=0,\"-\",IF(C5=1,G5,\"-\"))","v":"-"}]
[2,"Fachwissen Vermarktungsfunktionär",1,{"$f":"IF(C6=\"-\",0,IFERROR(($D$2/COUNTIF($C$5:$C$13,\">0\")*(H6/F6)),0))","v":0},{"$f":"IF(C6=1,D6,\"-\")","v":0},"100%",0.67,{"$f":"IF($D$2=0,\"-\",IF(C6=1,G6,\"-\"))","v":"-"}]
[3,"Berufliche Fähigkeiten Verm.Funktionär",1,{"$f":"IF(C7=\"-\",0,IFERROR(($D$2/COUNTIF($C$5:$C$13,\">0\")*(H7/F7)),0))","v":0},0,"100%",0.66,"-"]
[4,"Soziale Kompetenz  Vermarktungsfunktionär",1,{"$f":"IF(C8=\"-\",0,IFERROR(($D$2/COUNTIF($C$5:$C$13,\">0\")*(H8/F8)),0))","v":0},0,{"$f":"IF(C8=\"-\",\"-\",\"100%\")","v":"100%"},0.65,"-"]
[5,"Weiterbildung Vermarktungsfunktionär",1,0,0,{"$f":"IF(C9=\"-\",\"-\",\"100%\")","v":"100%"},0.64,"-"]
[6,"Standing in der Region Verm_Fkt.",1,0,0,"100%",0.63,"-"]
[7,"Zeitliche Ressourcen Verm_Fkt.",1,0,0,"100%",0.62,"-"]
[8,"Identifikation Verm_Fkt.",1,0,0,"100%",0.61,"-"]
[9,"Test Verm_Fkt.",1,0,0,"100%",0.6,"-"]

{"sheet":"B_II_Verw_Konzept","index":18,"n_rows":21,"n_cols":19,"rows_kept":21,"cut":false,"hidden":false,"merged":[[1,1,1,2],[2,1,2,2],[0,1,0,3],[0,4,0,6],[3,1,3,2],[3,5,3,6]]}
[null,"Strategy Map - Verein 4.0",null,null,{"$f":"B_Konzept!$E$1","v":"Union TTI St. Florian"},null,null,null,null,null,{"$f":"$B$5","v":"C. Verwaltungsperspektive"},{"$f":"B_II_C_C1_VerwP_EffektveVerw!$B$4","v":"C1. Effektive Verwaltung aufgebaut"},null,{"$f":"B_II_C_C2_Rahmenbe_f_Funktionär!$B$4","v":"C2. Rahmenbedingung für Funktionäre"},null,{"$f":"'B_II_C_C3_Infrastruktur Beteili'!$B$4","v":"C3. Infrastruktur für alle Beteiligten"}]
[null,"II. Verwaltungskonzept",null,{"$f":"B_Konzept!I6","v":0},{"$f":"IFERROR(E3/D2,0)","v":0},{"$f":"IFERROR(D2/G2,0)","v":0},{"$f":"COUNTIF($C$5:$C$8,1)","v":1},null,null,null,null,{"$f":"B_II_C_C1_VerwP_EffektveVerw!B5","v":"Effektive Verwaltung_1"},{"$f":"IF($D$2>0,IF($C$5=\"-\",\"-\",B_II_C_C1_VerwP_EffektveVerw!H5),\"-\")","v":"-"},{"$f":"B_II_C_C2_Rahmenbe_f_Funktionär!B5","v":"Rahmenbedingungen"},{"$f":"IF($D$2>0,IF($C$5=\"-\",\"-\",B_II_C_C2_Rahmenbe_f_Funktionär!H5),\"-\")","v":"-"},{"$f":"'B_II_C_C3_Infrastruktur Beteili'!B5","v":"Strukturen"},{"$f":"IF($D$2>0,IF($C$5=\"-\",\"-\",'B_II_C_C3_Infrastruktur Beteili'!H5),\"-\")","v":"-"}]
[null,"Verwaltungskonzepte",null,"Punkte",{"$f":"SUM(D5:D7)","v":0},"SOLL","IST",null,null,null,null,{"$f":"B_II_C_C1_VerwP_EffektveVerw!B6","v":"Effektive Verwaltung_2"},{"$f":"IF($D$2>0,IF($C$5=\"-\",\"-\",B_II_C_C1_VerwP_EffektveVerw!H6),\"-\")","v":"-"},{"$f":"B_II_C_C2_Rahmenbe_f_Funktionär!B6","v":"Rahmenbedingungen_2"},{"$f":"IF($D$2>0,IF($C$5=\"-\",\"-\",B_II_C_C2_Rahmenbe_f_Funktionär!H6),\"-\")","v":"-"},{"$f":"'B_II_C_C3_Infrastruktur Beteili'!B6","v":"Infrastruktur_2"},{"$f":"IF($D$2>0,IF($C$5=\"-\",\"-\",'B_II_C_C3_Infrastruktur Beteili'!H6),\"-\")","v":"-"}]
[null,null,null,"Konzept",null,"Die Ebenen",null,null,null,null,null,{"$f":"B_II_C_C1_VerwP_EffektveVerw!B7","v":"Effektive Verwaltung_3"},{"$f":"IF($D$2>0,IF($C$5=\"-\",\"-\",B_II_C_C1_VerwP_EffektveVerw!H7),\"-\")","v":"-"},{"$f":"B_II_C_C2_Rahmenbe_f_Funktionär!B7","v":"Rahmenbedingungen_3"},{"$f":"IF($D$2>0,IF($C$5=\"-\",\"-\",B_II_C_C2_Rahmenbe_f_Funktionär!H7),\"-\")","v":"-"},{"$f":"'B_II_C_C3_Infrastruktur Beteili'!B7","v":"Infrastruktur_3"},{"$f":"IF($D$2>0,IF($C$5=\"-\",\"-\",'B_II_C_C3_Infrastruktur Beteili'!H7),\"-\")","v":"-"}]
[1,{"$f":"B_II_C_VerwaltungsPersp!B4","v":"C. Verwaltungsperspektive"},"-",{"$f":"IF(C5=\"-\",\"-\",IFERROR(($D$2/COUNTIF($C$5:$C$8,\">0\")*(H5/F5)),\"-\"))","v":"-"},{"$f":"D5","v":"-"},{"$f":"IF(C5=\"-\",\"-\",\"100%\")","v":"-"},{"$f":"IF(C5=1,B_II_C_VerwaltungsPersp!E2,\"-\")","v":"-"},{"$f":"IF(C5=1,G5,\"-\")","v":"-"},{"$f":"IFERROR(C5*$F$2,0)","v":0},null,null,{"$f":"B_II_C_C1_VerwP_EffektveVerw!B8","v":"Effektive Verwaltung_4"},{"$f":"IF($D$2>0,IF($C$5=\"-\",\"-\",B_II_C_C1_VerwP_EffektveVerw!H8),\"-\")","v":"-"},{"$f":"B_II_C_C2_Rahmenbe_f_Funktionär!B8","v":"Rahmenbedingungen_4"},{"$f":"IF($D$2>0,IF($C$5=\"-\",\"-\",B_II_C_C2_Rahmenbe_f_Funktionär!H8),\"-\")","v":"-"},{"$f":"'B_II_C_C3_Infrastruktur Beteili'!B8","v":"Infrastruktur_4"},{"$f":"IF($D$2>0,IF($C$5=\"-\",\"-\",'B_II_C_C3_Infrastruktur Beteili'!H8),\"-\")","v":"-"}]
[2,{"$f":"'B_II_D FinanzPersp'!B4","v":"D. Finanzperspektive"},1,{"$f":"IF(C6=\"-\",\"-\",IFERROR(($D$2/COUNTIF($C$5:$C$8,\">0\")*(H6/F6)),\"-\"))","v":0},{"$f":"D6","v":0},{"$f":"IF(C6=\"-\",\"-\",\"100%\")","v":"100%"},{"$f":"IF(C6=1,'B_II_D FinanzPersp'!E2,\"-\")","v":0},{"$f":"IF(C6=1,G6,\"-\")","v":0},{"$f":"IFERROR(C6*$F$2,0)","v":0},null,null,{"$f":"B_II_C_C1_VerwP_EffektveVerw!B9","v":"Effektive Verwaltung_5"},{"$f":"IF($D$2>0,IF($C$5=\"-\",\"-\",B_II_C_C1_VerwP_EffektveVerw!H9),\"-\")","v":"-"},{"$f":"B_II_C_C2_Rahmenbe_f_Funktionär!B9","v":"Rahmenbedingungen_5"},{"$f":"IF($D$2>0,IF($C$5=\"-\",\"-\",B_II_C_C2_Rahmenbe_f_Funktionär!H9),\"-\")","v":"-"},{"$f":"'B_II_C_C3_Infrastruktur Beteili'!B9","v":"Infrastruktur_5"},{"$f":"IF($D$2>0,IF($C$5=\"-\",\"-\",'B_II_C_C3_Infrastruktur Beteili'!H9),\"-\")","v":"-"}]
[3,null,"-","-","-",{"$f":"IF(C7=\"-\",\"-\",\"100%\")","v":"-"},{"$f":"IF(C7=1,'B_II_D FinanzPersp'!E3,\"-\")","v":"-"},"-",{"$f":"IFERROR(C7*$F$2,0)","v":0},null,null,{"$f":"B_II_C_C1_VerwP_EffektveVerw!B10","v":"Effektive Verwaltung_6"},{"$f":"IF($D$2>0,IF($C$5=\"-\",\"-\",B_II_C_C1_VerwP_EffektveVerw!H10),\"-\")","v":"-"},{"$f":"B_II_C_C2_Rahmenbe_f_Funktionär!B10","v":"Rahmenbedingungen_6"},{"$f":"IF($D$2>0,IF($C$5=\"-\",\"-\",B_II_C_C2_Rahmenbe_f_Funktionär!H10),\"-\")","v":"-"},{"$f":"'B_II_C_C3_Infrastruktur Beteili'!B10","v":"Infrastruktur_6"},{"$f":"IF($D$2>0,IF($C$5=\"-\",\"-\",'B_II_C_C3_Infrastruktur Beteili'!H10),\"-\")","v":"-"}]
[4,null,"-","-",{"$f":"D8","v":"-"},{"$f":"IF(C8=\"-\",\"-\",\"100%\")","v":"-"},{"$f":"IF(C8=1,'B_II_D FinanzPersp'!E4,\"-\")","v":"-"},"-",0,null,null,{"$f":"B_II_C_C1_VerwP_EffektveVerw!B11","v":"Effektive Verwaltung_7"},{"$f":"IF($D$2>0,IF($C$5=\"-\",\"-\",B_II_C_C1_VerwP_EffektveVerw!H11),\"-\")","v":"-"},{"$f":"B_II_C_C2_Rahmenbe_f_Funktionär!B11","v":"Rahmenbedingungen_7"},{"$f":"IF($D$2>0,IF($C$5=\"-\",\"-\",B_II_C_C2_Rahmenbe_f_Funktionär!H11),\"-\")","v":"-"},{"$f":"'B_II_C_C3_Infrastruktur Beteili'!B11","v":"Infrastruktur_7"},{"$f":"IF($D$2>0,IF($C$5=\"-\",\"-\",'B_II_C_C3_Infrastruktur Beteili'!H11),\"-\")","v":"-"}]
[null,null,null,null,null,null,null,null,null,null,null,{"$f":"B_II_C_C1_VerwP_EffektveVerw!B12","v":"Effektive Verwaltung_8"},{"$f":"IF($D$2>0,IF($C$5=\"-\",\"-\",B_II_C_C1_VerwP_EffektveVerw!H12),\"-\")","v":"-"},{"$f":"B_II_C_C2_Rahmenbe_f_Funktionär!B12","v":"Rahmenbedingungen_8"},{"$f":"IF($D$2>0,IF($C$5=\"-\",\"-\",B_II_C_C2_Rahmenbe_f_Funktionär!H12),\"-\")","v":"-"},{"$f":"'B_II_C_C3_Infrastruktur Beteili'!B12","v":"Infrastruktur_8"},{"$f":"IF($D$2>0,IF($C$5=\"-\",\"-\",'B_II_C_C3_Infrastruktur Beteili'!H12),\"-\")","v":"-"}]
[null,null,null,null,null,null,null,null,null,null,null,{"$f":"B_II_C_C1_VerwP_EffektveVerw!B13","v":"Effektive Verwaltung_9"},{"$f":"IF($D$2>0,IF($C$5=\"-\",\"-\",B_II_C_C1_VerwP_EffektveVerw!H13),\"-\")","v":"-"},{"$f":"B_II_C_C2_Rahmenbe_f_Funktionär!B13","v":"Rahmenbedingungen_9"},{"$f":"IF($D$2>0,IF($C$5=\"-\",\"-\",B_II_C_C2_Rahmenbe_f_Funktionär!H13),\"-\")","v":"-"},{"$f":"'B_II_C_C3_Infrastruktur Beteili'!B13","v":"Infrastruktur_9"},{"$f":"IF($D$2>0,IF($C$5=\"-\",\"-\",'B_II_C_C3_Infrastruktur Beteili'!H13),\"-\")","v":"-"}]
[]
[null,null,null,null,null,null,null,null,null,null,{"$f":"$B$6","v":"D. Finanzperspektive"},{"$f":"'B_II_D_D1_Unterstützer FinanzP'!$B$4","v":"D1. Unterstützer des Vereins"},null,{"$f":"'B_II_D_D2_Sport FinanzP'!$B$4","v":"D2. Sportlicher Bereich"},null,{"$f":"'B_II_D_D3_Veranstaltung FinanzP'!$B$4","v":"D3. Veranstaltungen"},null,{"$f":"'B_II_D_D4_Gastro FinanzP'!$B$4","v":"D4. Gastronomie"}]
[null,null,null,null,null,null,null,null,null,null,null,{"$f":"'B_II_D_D1_Unterstützer FinanzP'!B5","v":"BVer1 - Sponsorenanteil am Budget steigt"},{"$f":"IF($D$2>0,IF($C$6=\"-\",\"-\",'B_II_D_D1_Unterstützer FinanzP'!H5),\"-\")","v":"-"},{"$f":"'B_II_D_D2_Sport FinanzP'!B5","v":"BVer2 - Spieltagsumsatz steigt"},{"$f":"IF($D$2>0,IF($C$6=\"-\",\"-\",'B_II_D_D2_Sport FinanzP'!H5),\"-\")","v":"-"},{"$f":"'B_II_D_D3_Veranstaltung FinanzP'!B5","v":"Höhere Gewinne bei Veranstaltungen"},{"$f":"IF($D$2>0,IF($C$6=\"-\",\"-\",'B_II_D_D3_Veranstaltung FinanzP'!G5),\"-\")","v":"-"},{"$f":"'B_II_D_D4_Gastro FinanzP'!B5","v":"Buffet/Kantine"},{"$f":"IF($D$2>0,IF($C$6=\"-\",\"-\",'B_II_D_D4_Gastro FinanzP'!H5),\"-\")","v":"-"}]
[null,null,null,null,null,null,null,null,null,null,null,{"$f":"'B_II_D_D1_Unterstützer FinanzP'!B6","v":"BVer3 - Zahlungsüberschuss (Cash Flow) steigt"},{"$f":"IF($D$2>0,IF($C$6=\"-\",\"-\",'B_II_D_D1_Unterstützer FinanzP'!H6),\"-\")","v":"-"},{"$f":"'B_II_D_D2_Sport FinanzP'!B6","v":"Transfererlöse steigen"},{"$f":"IF($D$2>0,IF($C$6=\"-\",\"-\",'B_II_D_D2_Sport FinanzP'!H6),\"-\")","v":"-"},{"$f":"'B_II_D_D3_Veranstaltung FinanzP'!B6","v":"Sommerfeste"},{"$f":"IF($D$2>0,IF($C$6=\"-\",\"-\",'B_II_D_D3_Veranstaltung FinanzP'!G6),\"-\")","v":"-"},{"$f":"'B_II_D_D4_Gastro FinanzP'!B6","v":"Tribüne"},{"$f":"IF($D$2>0,IF($C$6=\"-\",\"-\",'B_II_D_D4_Gastro FinanzP'!H6),\"-\")","v":"-"}]
[null,null,null,null,null,null,null,null,null,null,null,{"$f":"'B_II_D_D1_Unterstützer FinanzP'!B7","v":"Mitgliedsbeiträge steigen"},{"$f":"IF($D$2>0,IF($C$6=\"-\",\"-\",'B_II_D_D1_Unterstützer FinanzP'!H7),\"-\")","v":"-"},{"$f":"'B_II_D_D2_Sport FinanzP'!B7","v":"Verkaufserlöse"},{"$f":"IF($D$2>0,IF($C$6=\"-\",\"-\",'B_II_D_D2_Sport FinanzP'!H7),\"-\")","v":"-"},{"$f":"'B_II_D_D3_Veranstaltung FinanzP'!B7","v":"Winterveranstaltungen"},{"$f":"IF($D$2>0,IF($C$6=\"-\",\"-\",'B_II_D_D3_Veranstaltung FinanzP'!G7),\"-\")","v":"-"},{"$f":"'B_II_D_D4_Gastro FinanzP'!B7","v":"Hütten"},{"$f":"IF($D$2>0,IF($C$6=\"-\",\"-\",'B_II_D_D4_Gastro FinanzP'!H7),\"-\")","v":"-"}]
[null,null,null,null,null,null,null,null,null,null,null,{"$f":"'B_II_D_D1_Unterstützer FinanzP'!B8","v":"Subventionen Gemeinde"},{"$f":"IF($D$2>0,IF($C$6=\"-\",\"-\",'B_II_D_D1_Unterstützer FinanzP'!H8),\"-\")","v":"-"},{"$f":"'B_II_D_D2_Sport FinanzP'!B8","v":"Leihgebühren"},{"$f":"IF($D$2>0,IF($C$6=\"-\",\"-\",'B_II_D_D2_Sport FinanzP'!H8),\"-\")","v":"-"},{"$f":"'B_II_D_D3_Veranstaltung FinanzP'!B8","v":"Flohmarkt"},{"$f":"IF($D$2>0,IF($C$6=\"-\",\"-\",'B_II_D_D3_Veranstaltung FinanzP'!G8),\"-\")","v":"-"},{"$f":"'B_II_D_D4_Gastro FinanzP'!B8","v":"Nachwuchshütte"},{"$f":"IF($D$2>0,IF($C$6=\"-\",\"-\",'B_II_D_D4_Gastro FinanzP'!H8),\"-\")","v":"-"}]
[null,null,null,null,null,null,null,null,null,null,null,{"$f":"'B_II_D_D1_Unterstützer FinanzP'!B9","v":"Sponsoren"},{"$f":"IF($D$2>0,IF($C$6=\"-\",\"-\",'B_II_D_D1_Unterstützer FinanzP'!H9),\"-\")","v":"-"},{"$f":"'B_II_D_D2_Sport FinanzP'!B9","v":"Vermietungen"},{"$f":"IF($D$2>0,IF($C$6=\"-\",\"-\",'B_II_D_D2_Sport FinanzP'!H9),\"-\")","v":"-"},{"$f":"'B_II_D_D3_Veranstaltung FinanzP'!B9","v":"Weihnachtsmarkt"},{"$f":"IF($D$2>0,IF($C$6=\"-\",\"-\",'B_II_D_D3_Veranstaltung FinanzP'!G9),\"-\")","v":"-"},{"$f":"'B_II_D_D4_Gastro FinanzP'!B9","v":"Sonstige"},{"$f":"IF($D$2>0,IF($C$6=\"-\",\"-\",'B_II_D_D4_Gastro FinanzP'!H9),\"-\")","v":"-"}]
[null,null,null,null,null,null,null,null,null,null,null,{"$f":"'B_II_D_D1_Unterstützer FinanzP'!B10","v":"Partnerschaften"},{"$f":"IF($D$2>0,IF($C$6=\"-\",\"-\",'B_II_D_D1_Unterstützer FinanzP'!H10),\"-\")","v":"-"},{"$f":"'B_II_D_D2_Sport FinanzP'!B10","v":"Spieltagssponsoring"},{"$f":"IF($D$2>0,IF($C$6=\"-\",\"-\",'B_II_D_D2_Sport FinanzP'!H10),\"-\")","v":"-"},{"$f":"'B_II_D_D3_Veranstaltung FinanzP'!B10","v":"Eisstockturnier"},{"$f":"IF($D$2>0,IF($C$6=\"-\",\"-\",'B_II_D_D3_Veranstaltung FinanzP'!G10),\"-\")","v":"-"},{"$f":"'B_II_D_D4_Gastro FinanzP'!B10","v":"Gastronomie_6"},{"$f":"IF($D$2>0,IF($C$6=\"-\",\"-\",'B_II_D_D4_Gastro FinanzP'!H10),\"-\")","v":"-"}]
[null,null,null,null,null,null,null,null,null,null,null,{"$f":"'B_II_D_D1_Unterstützer FinanzP'!B11","v":"Subventionen Verband/Land"},{"$f":"IF($D$2>0,IF($C$6=\"-\",\"-\",'B_II_D_D1_Unterstützer FinanzP'!H11),\"-\")","v":"-"},{"$f":"'B_II_D_D2_Sport FinanzP'!B11","v":"Matchballsponsoring"},{"$f":"IF($D$2>0,IF($C$6=\"-\",\"-\",'B_II_D_D2_Sport FinanzP'!H11),\"-\")","v":"-"},{"$f":"'B_II_D_D3_Veranstaltung FinanzP'!B11","v":"Faschingsumzug"},{"$f":"IF($D$2>0,IF($C$6=\"-\",\"-\",'B_II_D_D3_Veranstaltung FinanzP'!G11),\"-\")","v":"-"},{"$f":"'B_II_D_D4_Gastro FinanzP'!B11","v":"Gastronomie_7"},{"$f":"IF($D$2>0,IF($C$6=\"-\",\"-\",'B_II_D_D4_Gastro FinanzP'!H11),\"-\")","v":"-"}]
[null,null,null,null,null,null,null,null,null,null,null,{"$f":"'B_II_D_D1_Unterstützer FinanzP'!B12","v":"Subventionen steigen"},{"$f":"IF($D$2>0,IF($C$6=\"-\",\"-\",'B_II_D_D1_Unterstützer FinanzP'!H12),\"-\")","v":"-"},{"$f":"'B_II_D_D2_Sport FinanzP'!B12","v":"Werbedurchsagen"},{"$f":"IF($D$2>0,IF($C$6=\"-\",\"-\",'B_II_D_D2_Sport FinanzP'!H12),\"-\")","v":"-"},{"$f":"'B_II_D_D3_Veranstaltung FinanzP'!B12","v":"Stadtfest"},{"$f":"IF($D$2>0,IF($C$6=\"-\",\"-\",'B_II_D_D3_Veranstaltung FinanzP'!G12),\"-\")","v":"-"},{"$f":"'B_II_D_D4_Gastro FinanzP'!B12","v":"Gastronomie_8"},{"$f":"IF($D$2>0,IF($C$6=\"-\",\"-\",'B_II_D_D4_Gastro FinanzP'!H12),\"-\")","v":"-"}]
[null,null,null,null,null,null,null,null,null,null,null,{"$f":"'B_II_D_D1_Unterstützer FinanzP'!B13","v":"Unterstützer"},{"$f":"IF($D$2>0,IF($C$6=\"-\",\"-\",'B_II_D_D1_Unterstützer FinanzP'!H13),\"-\")","v":"-"},{"$f":"'B_II_D_D2_Sport FinanzP'!B13","v":"Fanshop"},{"$f":"IF($D$2>0,IF($C$6=\"-\",\"-\",'B_II_D_D2_Sport FinanzP'!H13),\"-\")","v":"-"},{"$f":"'B_II_D_D3_Veranstaltung FinanzP'!B13","v":"Veranstaltung_9"},{"$f":"IF($D$2>0,IF($C$6=\"-\",\"-\",'B_II_D_D3_Veranstaltung FinanzP'!G13),\"-\")","v":"-"},{"$f":"'B_II_D_D4_Gastro FinanzP'!B13","v":"Gastronomie_9"},{"$f":"IF($D$2>0,IF($C$6=\"-\",\"-\",'B_II_D_D4_Gastro FinanzP'!H13),\"-\")","v":"-"}]

{"sheet":"B_II_C_VerwaltungsPersp","index":19,"n_rows":8,"n_cols":9,"rows_kept":8,"cut":false,"hidden":true,"merged":[[3,5,3,6],[3,1,3,2],[1,1,1,2],[2,1,2,2],[0,4,0,6],[0,1,0,3]]}
[null,"Strategy Map - Verein 4.0",null,null,{"$f":"B_Konzept!$E$1","v":"Union TTI St. Florian"}]
[null,"II. Verwaltungskonzept",null,{"$f":"B_II_Verw_Konzept!I5","v":0},{"$f":"IFERROR(E3/D2,0)","v":0},{"$f":"IFERROR(D2/G2,0)","v":0},{"$f":"COUNTIF($C$5:$C$8,1)","v":3}]
[null,"Verwaltungskonzepte",null,"Punkte",{"$f":"SUM(D5:D8)","v":0},"SOLL","IST"]
[null,"C. Verwaltungsperspektive",null,"Konzept",null,"Die Ebenen"]
[1,{"$f":"B_II_C_C1_VerwP_EffektveVerw!B4","v":"C1. Effektive Verwaltung aufgebaut"},1,{"$f":"IF(C5=\"-\",\"-\",IFERROR(($D$2/COUNTIF($C$5:$C$8,\">0\")*(H5/F5)),\"-\"))","v":0},{"$f":"D5","v":0},{"$f":"IF(C5=\"-\",\"-\",\"100%\")","v":"100%"},{"$f":"IF(C5=1,B_II_C_C1_VerwP_EffektveVerw!E2,\"-\")","v":0},{"$f":"IF(C5=1,G5,\"-\")","v":0},{"$f":"IFERROR($F$2*C5,0)","v":0}]
[2,{"$f":"B_II_C_C2_Rahmenbe_f_Funktionär!B4","v":"C2. Rahmenbedingung für Funktionäre"},1,0,{"$f":"D6","v":0},{"$f":"IF(C6=\"-\",\"-\",\"100%\")","v":"100%"},{"$f":"IF(C6=1,B_II_C_C2_Rahmenbe_f_Funktionär!E2,\"-\")","v":0},{"$f":"IF(C6=1,G6,\"-\")","v":0},{"$f":"IFERROR($F$2*C6,0)","v":0}]
[3,{"$f":"'B_II_C_C3_Infrastruktur Beteili'!B4","v":"C3. Infrastruktur für alle Beteiligten"},1,0,0,{"$f":"IF(C7=\"-\",\"-\",\"100%\")","v":"100%"},{"$f":"IF(C7=1,'B_II_C_C3_Infrastruktur Beteili'!E2,\"-\")","v":0},0,0]
[4,null,"-",{"$f":"IF(C8=\"-\",\"-\",IFERROR(($D$2/COUNTIF($C$5:$C$8,\">0\")*(H8/F8)),\"-\"))","v":"-"},"-",{"$f":"IF(C8=\"-\",\"-\",\"100%\")","v":"-"},"-","-",{"$f":"IFERROR($F$2*C8,0)","v":0}]

{"sheet":"B_II_C_C1_VerwP_EffektveVerw","index":20,"n_rows":13,"n_cols":8,"rows_kept":13,"cut":false,"hidden":true,"merged":[[3,5,3,6],[3,1,3,2],[1,1,1,2],[2,1,2,2],[0,4,0,6],[0,1,0,3]]}
[null,"Strategy Map - Verein 4.0",null,null,{"$f":"B_Konzept!$E$1","v":"Union TTI St. Florian"}]
[null,"II. Verwaltungskonzept",null,{"$f":"B_II_C_VerwaltungsPersp!I5","v":0},{"$f":"IFERROR(E3/D2,0)","v":0},{"$f":"IFERROR(D2/G2,0)","v":0},{"$f":"COUNTIF($C$5:$C$13,1)","v":9}]
[null,"C. Verwaltungsperspektive",null,"Punkte",{"$f":"SUM(D5:D13)","v":0},"SOLL","IST"]
[null,"C1. Effektive Verwaltung aufgebaut",null,"Konzept",null,"Die Ebenen"]
[1,"Effektive Verwaltung_1",1,{"$f":"IF(C5=\"-\",0,IFERROR(($D$2/COUNTIF($C$5:$C$13,\">0\")*(H5/F5)),0))","v":0},{"$f":"IF(C5=1,D5,\"-\")","v":0},{"$f":"IF(C5=\"-\",\"-\",\"100%\")","v":"100%"},0.98,{"$f":"IF($D$2=0,\"-\",IF(C5=1,G5,\"-\"))","v":"-"}]
[2,"Effektive Verwaltung_2",1,0,0,"100%",0.97,{"$f":"IF($D$2=0,\"-\",IF(C6=1,G6,\"-\"))","v":"-"}]
[3,"Effektive Verwaltung_3",1,0,0,"100%",0.96,"-"]
[4,"Effektive Verwaltung_4",1,0,{"$f":"IF(C8=1,D8,\"-\")","v":0},{"$f":"IF(C8=\"-\",\"-\",\"100%\")","v":"100%"},0.95,"-"]
[5,"Effektive Verwaltung_5",1,0,0,{"$f":"IF(C9=\"-\",\"-\",\"100%\")","v":"100%"},0.94,"-"]
[6,"Effektive Verwaltung_6",1,0,0,"100%",0.93,"-"]
[7,"Effektive Verwaltung_7",1,0,0,"100%",0.92,"-"]
[8,"Effektive Verwaltung_8",1,0,0,"100%",0.91,"-"]
[9,"Effektive Verwaltung_9",1,0,0,"100%",0.9,"-"]

{"sheet":"B_II_C_C2_Rahmenbe_f_Funktionär","index":21,"n_rows":13,"n_cols":8,"rows_kept":13,"cut":false,"hidden":true,"merged":[[3,5,3,6],[3,1,3,2],[1,1,1,2],[2,1,2,2],[0,4,0,6],[0,1,0,3]]}
[null,"Strategy Map - Verein 4.0",null,null,{"$f":"B_Konzept!$E$1","v":"Union TTI St. Florian"}]
[null,"II. Verwaltungskonzept",null,{"$f":"B_II_C_VerwaltungsPersp!I6","v":0},{"$f":"IFERROR(E3/D2,0)","v":0},{"$f":"IFERROR(D2/G2,0)","v":0},{"$f":"COUNTIF($C$5:$C$13,1)","v":9}]
[null,"C. Verwaltungsperspektive",null,"Punkte",{"$f":"SUM(D5:D13)","v":0},"SOLL","IST"]
[null,"C2. Rahmenbedingung für Funktionäre",null,"Konzept",null,"Die Ebenen"]
[1,"Rahmenbedingungen",1,{"$f":"IF(C5=\"-\",0,IFERROR(($D$2/COUNTIF($C$5:$C$13,\">0\")*(H5/F5)),0))","v":0},{"$f":"IF(C5=1,D5,\"-\")","v":0},{"$f":"IF(C5=\"-\",\"-\",\"100%\")","v":"100%"},0.88,{"$f":"IF($D$2=0,\"-\",IF(C5=1,G5,\"-\"))","v":"-"}]
[2,"Rahmenbedingungen_2",1,0,0,"100%",0.869999999999999,{"$f":"IF($D$2=0,\"-\",IF(C6=1,G6,\"-\"))","v":"-"}]
[3,"Rahmenbedingungen_3",1,0,0,"100%",0.86,"-"]
[4,"Rahmenbedingungen_4",1,0,0,{"$f":"IF(C8=\"-\",\"-\",\"100%\")","v":"100%"},0.85,"-"]
[5,"Rahmenbedingungen_5",1,0,0,{"$f":"IF(C9=\"-\",\"-\",\"100%\")","v":"100%"},0.84,"-"]
[6,"Rahmenbedingungen_6",1,0,0,"100%",0.83,"-"]
[7,"Rahmenbedingungen_7",1,0,0,"100%",0.82,"-"]
[8,"Rahmenbedingungen_8",1,0,0,"100%",0.81,"-"]
[9,"Rahmenbedingungen_9",1,0,0,"100%",0.8,"-"]

{"sheet":"B_II_C_C3_Infrastruktur Beteili","index":22,"n_rows":13,"n_cols":8,"rows_kept":13,"cut":false,"hidden":true,"merged":[[3,5,3,6],[3,1,3,2],[1,1,1,2],[2,1,2,2],[0,4,0,6],[0,1,0,3]]}
[null,"Strategy Map - Verein 4.0",null,null,{"$f":"B_Konzept!$E$1","v":"Union TTI St. Florian"}]
[null,"II. Verwaltungskonzept",null,{"$f":"B_II_C_VerwaltungsPersp!I7","v":0},{"$f":"IFERROR(E3/D2,0)","v":0},{"$f":"IFERROR(D2/G2,0)","v":0},{"$f":"COUNTIF($C$5:$C$13,1)","v":9}]
[null,"C. Verwaltungsperspektive",null,"Punkte",{"$f":"SUM(D5:D13)","v":0},"SOLL","IST"]
[null,"C3. Infrastruktur für alle Beteiligten",null,"Konzept",null,"Die Ebenen"]
[1,"Strukturen",1,{"$f":"IF(C5=\"-\",0,IFERROR(($D$2/COUNTIF($C$5:$C$13,\">0\")*(H5/F5)),0))","v":0},{"$f":"IF(C5=1,D5,\"-\")","v":0},{"$f":"IF(C5=\"-\",\"-\",\"100%\")","v":"100%"},0.78,{"$f":"IF($D$2=0,\"-\",IF(C5=1,G5,\"-\"))","v":"-"}]
[2,"Infrastruktur_2",1,0,0,"100%",0.77,{"$f":"IF($D$2=0,\"-\",IF(C6=1,G6,\"-\"))","v":"-"}]
[3,"Infrastruktur_3",1,0,0,"100%",0.76,"-"]
[4,"Infrastruktur_4",1,0,0,{"$f":"IF(C8=\"-\",\"-\",\"100%\")","v":"100%"},0.75,"-"]
[5,"Infrastruktur_5",1,0,0,{"$f":"IF(C9=\"-\",\"-\",\"100%\")","v":"100%"},0.74,"-"]
[6,"Infrastruktur_6",1,0,0,"100%",0.73,"-"]
[7,"Infrastruktur_7",1,0,0,"100%",0.72,"-"]
[8,"Infrastruktur_8",1,0,0,"100%",0.71,"-"]
[9,"Infrastruktur_9",1,0,0,"100%",0.7,"-"]

{"sheet":"B_II_D FinanzPersp","index":23,"n_rows":8,"n_cols":9,"rows_kept":8,"cut":false,"hidden":false,"merged":[[3,5,3,6],[3,1,3,2],[1,1,1,2],[2,1,2,2],[0,4,0,6],[0,1,0,3]]}
[null,"Strategy Map - Verein 4.0",null,null,{"$f":"B_Konzept!$E$1","v":"Union TTI St. Florian"}]
[null,"II. Verwaltungskonzept",null,{"$f":"B_II_Verw_Konzept!I6","v":0},{"$f":"IFERROR(E3/D2,0)","v":0},{"$f":"IFERROR(D2/G2,0)","v":0},{"$f":"COUNTIF($C$5:$C$8,1)","v":2}]
[null,"Verwaltungskonzepte",null,"Punkte",{"$f":"SUM(D5:D8)","v":0},"SOLL","IST"]
[null,"D. Finanzperspektive",null,"Konzept",null,"Die Ebenen"]
[1,{"$f":"'B_II_D_D1_Unterstützer FinanzP'!B4","v":"D1. Unterstützer des Vereins"},1,{"$f":"IF(C5=\"-\",\"-\",IFERROR(($D$2/COUNTIF($C$5:$C$8,\">0\")*(H5/F5)),\"-\"))","v":0},{"$f":"D5","v":0},{"$f":"IF(C5=\"-\",\"-\",\"100%\")","v":"100%"},{"$f":"IF(C5=1,'B_II_D_D1_Unterstützer FinanzP'!E2,\"-\")","v":0},{"$f":"IF(C5=1,G5,\"-\")","v":0},{"$f":"IFERROR($F$2*C5,0)","v":0}]
[2,{"$f":"'B_II_D_D2_Sport FinanzP'!B4","v":"D2. Sportlicher Bereich"},1,{"$f":"IF(C6=\"-\",\"-\",IFERROR(($D$2/COUNTIF($C$5:$C$8,\">0\")*(H6/F6)),\"-\"))","v":0},{"$f":"D6","v":0},{"$f":"IF(C6=\"-\",\"-\",\"100%\")","v":"100%"},{"$f":"IF(C6=1,'B_II_D_D2_Sport FinanzP'!E2,\"-\")","v":0},{"$f":"IF(C6=1,G6,\"-\")","v":0},{"$f":"IFERROR($F$2*C6,0)","v":0}]
[3,{"$f":"'B_II_D_D3_Veranstaltung FinanzP'!B4","v":"D3. Veranstaltungen"},"-","-","-",{"$f":"IF(C7=\"-\",\"-\",\"100%\")","v":"-"},{"$f":"IF(C7=1,'B_II_D_D3_Veranstaltung FinanzP'!E2,\"-\")","v":"-"},"-",0]
[4,{"$f":"'B_II_D_D4_Gastro FinanzP'!B4","v":"D4. Gastronomie"},"-","-","-",{"$f":"IF(C8=\"-\",\"-\",\"100%\")","v":"-"},{"$f":"IF(C8=1,'B_II_D_D4_Gastro FinanzP'!E2,\"-\")","v":"-"},"-",0]

{"sheet":"B_II_D_D1_Unterstützer FinanzP","index":24,"n_rows":13,"n_cols":8,"rows_kept":13,"cut":false,"hidden":false,"merged":[[3,5,3,6],[3,1,3,2],[1,1,1,2],[2,1,2,2],[0,4,0,6],[0,1,0,3]]}
[null,"Strategy Map - Verein 4.0",null,null,{"$f":"B_Konzept!$E$1","v":"Union TTI St. Florian"}]
[null,"II. Verwaltungskonzept",null,{"$f":"'B_II_D FinanzPersp'!I5","v":0},{"$f":"IFERROR(E3/D2,0)","v":0},{"$f":"IFERROR(D2/G2,0)","v":0},{"$f":"COUNTIF($C$5:$C$6,1)","v":2}]
[null,"D. Finanzperspektive",null,"Punkte",{"$f":"SUM(D5:D6)","v":0},"SOLL","IST"]
[null,"D1. Unterstützer des Vereins",null,"Konzept","Richtwerte","Die Ebenen"]
[1,"BVer1 - Sponsorenanteil am Budget steigt",1,{"$f":"IF(C5=\"-\",0,IFERROR(($D$2/COUNTIF($C$5:$C$6,\">0\")*(H5/F5)),0))","v":0},{"$f":"IF(C5=1,D5,\"-\")","v":0},{"$f":"IF(C5=\"-\",\"-\",\"100%\")","v":"100%"},0,{"$f":"IF($D$2=0,\"-\",IF(C5=1,G5,\"-\"))","v":"-"}]
[2,"BVer3 - Zahlungsüberschuss (Cash Flow) steigt",1,{"$f":"IF(C6=\"-\",0,IFERROR(($D$2/COUNTIF($C$5:$C$6,\">0\")*(H6/F6)),0))","v":0},0,"100%",0,{"$f":"IF($D$2=0,\"-\",IF(C6=1,G6,\"-\"))","v":"-"}]
[3,"Mitgliedsbeiträge steigen","-",{"$f":"IF(C7=\"-\",0,IFERROR(($D$2/COUNTIF($C$5:$C$13,\">0\")*(H7/F7)),0))","v":0},"-","-",0,"-"]
[4,"Subventionen Gemeinde","-",0,"-",{"$f":"IF(C8=\"-\",\"-\",\"100%\")","v":"-"},0,"-"]
[5,"Sponsoren","-",0,"-",{"$f":"IF(C9=\"-\",\"-\",\"100%\")","v":"-"},0,"-"]
[6,"Partnerschaften","-",0,"-","-",0,"-"]
[7,"Subventionen Verband/Land","-",0,"-","-",0,"-"]
[8,"Subventionen steigen","-",0,"-","-",0,"-"]
[9,"Unterstützer","-",0,"-","-",0,"-"]

{"sheet":"B_II_D_D2_Sport FinanzP","index":25,"n_rows":13,"n_cols":8,"rows_kept":13,"cut":false,"hidden":false,"merged":[[3,5,3,6],[3,1,3,2],[1,1,1,2],[2,1,2,2],[0,4,0,6],[0,1,0,3]]}
[null,"Strategy Map - Verein 4.0",null,null,{"$f":"B_Konzept!$E$1","v":"Union TTI St. Florian"}]
[null,"II. Verwaltungskonzept",null,{"$f":"'B_II_D FinanzPersp'!I6","v":0},{"$f":"IFERROR(E3/D2,0)","v":0},{"$f":"IFERROR(D2/G2,0)","v":0},{"$f":"COUNTIF($C$5:$C$5,1)","v":1}]
[null,"D. Finanzperspektive",null,"Punkte",{"$f":"SUM(D5:D5)","v":0},"SOLL","IST"]
[null,"D2. Sportlicher Bereich",null,"Konzept","Richtwerte","Die Ebenen"]
[1,"BVer2 - Spieltagsumsatz steigt",1,{"$f":"IF(C5=\"-\",0,IFERROR(($D$2/COUNTIF($C$5:$C$5,\">0\")*(H5/F5)),0))","v":0},{"$f":"IF(C5=1,D5,\"-\")","v":0},{"$f":"IF(C5=\"-\",\"-\",\"100%\")","v":"100%"},0,{"$f":"IF($D$2=0,\"-\",IF(C5=1,G5,\"-\"))","v":"-"}]
[2,"Transfererlöse steigen","-",{"$f":"IF(C6=\"-\",0,IFERROR(($D$2/COUNTIF($C$5:$C$13,\">0\")*(H6/F6)),0))","v":0},"-","-",0,{"$f":"IF($D$2=0,\"-\",IF(C6=1,G6,\"-\"))","v":"-"}]
[3,"Verkaufserlöse","-",0,"-","-",0,"-"]
[4,"Leihgebühren","-",0,"-",{"$f":"IF(C8=\"-\",\"-\",\"100%\")","v":"-"},0,"-"]
[5,"Vermietungen","-",0,"-",{"$f":"IF(C9=\"-\",\"-\",\"100%\")","v":"-"},0,"-"]
[6,"Spieltagssponsoring","-",0,"-","-",0,"-"]
[7,"Matchballsponsoring","-",0,"-","-",0,"-"]
[8,"Werbedurchsagen","-",0,"-","-",0,"-"]
[9,"Fanshop","-",0,"-","-",0,"-"]

{"sheet":"B_II_D_D3_Veranstaltung FinanzP","index":26,"n_rows":13,"n_cols":8,"rows_kept":13,"cut":false,"hidden":true,"merged":[[3,5,3,6],[3,1,3,2],[1,1,1,2],[2,1,2,2],[0,4,0,6],[0,1,0,3]]}
[null,"Strategy Map - Verein 4.0",null,null,{"$f":"B_Konzept!$E$1","v":"Union TTI St. Florian"}]
[null,"II. Verwaltungskonzept",null,{"$f":"'B_II_D FinanzPersp'!I7","v":0},{"$f":"IFERROR(E3/D2,0)","v":0},{"$f":"IFERROR(D2/G2,0)","v":0},{"$f":"COUNTIF($C$5:$C$13,1)","v":9}]
[null,"D. Finanzperspektive",null,"Punkte",{"$f":"SUM(D5:D13)","v":0},"SOLL","IST"]
[null,"D3. Veranstaltungen",null,"Konzept",null,"Die Ebenen"]
[1,"Höhere Gewinne bei Veranstaltungen",1,{"$f":"IF(C5=\"-\",0,IFERROR(($D$2/COUNTIF($C$5:$C$13,\">0\")*(H5/F5)),0))","v":0},{"$f":"IF(C5=1,D5,\"-\")","v":0},{"$f":"IF(C5=\"-\",\"-\",\"100%\")","v":"100%"},0.78,{"$f":"IF($D$2=0,\"-\",IF(C5=1,G5,\"-\"))","v":"-"}]
[2,"Sommerfeste",1,0,0,"100%",0.77,{"$f":"IF($D$2=0,\"-\",IF(C6=1,G6,\"-\"))","v":"-"}]
[3,"Winterveranstaltungen",1,0,0,"100%",0.76,"-"]
[4,"Flohmarkt",1,0,0,{"$f":"IF(C8=\"-\",\"-\",\"100%\")","v":"100%"},0.75,"-"]
[5,"Weihnachtsmarkt",1,0,0,{"$f":"IF(C9=\"-\",\"-\",\"100%\")","v":"100%"},0.74,"-"]
[6,"Eisstockturnier",1,0,0,"100%",0.73,"-"]
[7,"Faschingsumzug",1,0,0,"100%",0.72,"-"]
[8,"Stadtfest",1,0,0,"100%",0.71,"-"]
[9,"Veranstaltung_9",1,0,0,"100%",0.7,"-"]

{"sheet":"B_II_D_D4_Gastro FinanzP","index":27,"n_rows":13,"n_cols":8,"rows_kept":13,"cut":false,"hidden":true,"merged":[[3,5,3,6],[3,1,3,2],[1,1,1,2],[2,1,2,2],[0,4,0,6],[0,1,0,3]]}
[null,"Strategy Map - Verein 4.0",null,null,{"$f":"B_Konzept!$E$1","v":"Union TTI St. Florian"}]
[null,"II. Verwaltungskonzept",null,{"$f":"'B_II_D FinanzPersp'!I8","v":0},{"$f":"IFERROR(E3/D2,0)","v":0},{"$f":"IFERROR(D2/G2,0)","v":0},{"$f":"COUNTIF($C$5:$C$13,1)","v":9}]
[null,"D. Finanzperspektive",null,"Punkte",{"$f":"SUM(D5:D13)","v":0},"SOLL","IST"]
[null,"D4. Gastronomie",null,"Konzept",null,"Die Ebenen"]
[1,"Buffet/Kantine",1,{"$f":"IF(C5=\"-\",0,IFERROR(($D$2/COUNTIF($C$5:$C$13,\">0\")*(H5/F5)),0))","v":0},{"$f":"IF(C5=1,D5,\"-\")","v":0},{"$f":"IF(C5=\"-\",\"-\",\"100%\")","v":"100%"},0.68,{"$f":"IF($D$2=0,\"-\",IF(C5=1,G5,\"-\"))","v":"-"}]
[2,"Tribüne",1,0,0,"100%",0.67,{"$f":"IF($D$2=0,\"-\",IF(C6=1,G6,\"-\"))","v":"-"}]
[3,"Hütten",1,0,0,"100%",0.66,"-"]
[4,"Nachwuchshütte",1,0,0,{"$f":"IF(C8=\"-\",\"-\",\"100%\")","v":"100%"},0.65,"-"]
[5,"Sonstige",1,0,0,{"$f":"IF(C9=\"-\",\"-\",\"100%\")","v":"100%"},0.64,"-"]
[6,"Gastronomie_6",1,0,0,"100%",0.63,"-"]
[7,"Gastronomie_7",1,0,0,"100%",0.62,"-"]
[8,"Gastronomie_8",1,0,0,"100%",0.61,"-"]
[9,"Gastronomie_9",1,0,0,"100%",0.6,"-"]

{"sheet":"B_III_Sport_Konzept","index":28,"n_rows":32,"n_cols":19,"rows_kept":32,"cut":false,"hidden":false,"merged":[[1,1,1,2],[2,1,2,2],[0,1,0,3],[0,4,0,6],[3,1,3,2],[3,5,3,6]]}
[null,"Strategy Map - Verein 4.0",null,null,{"$f":"B_Konzept!$E$1","v":"Union TTI St. Florian"},null,null,null,null,null,{"$f":"$B$5","v":"E. Visionsperspektive"},{"$f":"'B_III_E_E1_SpP_V-Visionen'!$B$4","v":"E1. Vereinsvisionen"},null,{"$f":"'B_III_E_E2_SpP_Spielsys-Vision'!$B$4","v":"E2. Spielsystemvisionen KM / NW"},null,{"$f":"'B_III_E_E3_SpP_Vision KM'!$B$4","v":"E3. Sport-Spielvisionen KM"},null,{"$f":"'B_III_E_E4_SpP_Vision NW'!$B$4","v":"E4. Sport-Spielvisionen NW"}]
[null,"III. Sportkonzept",null,{"$f":"B_Konzept!I7","v":0},{"$f":"IFERROR(E3/D2,0)","v":0},{"$f":"IFERROR(D2/G2,0)","v":0},{"$f":"COUNTIF($C$5:$C$8,1)","v":1},null,null,null,null,{"$f":"'B_III_E_E1_SpP_V-Visionen'!B5","v":"Vereinsvision"},{"$f":"IF($D$2>0,IF($C$5=\"-\",\"-\",'B_III_E_E1_SpP_V-Visionen'!H5),\"-\")","v":"-"},{"$f":"'B_III_E_E2_SpP_Spielsys-Vision'!B5","v":"Tugenden/Motivation"},{"$f":"IF($D$2>0,IF($C$5=\"-\",\"-\",'B_III_E_E2_SpP_Spielsys-Vision'!H5),\"-\")","v":"-"},{"$f":"'B_III_E_E3_SpP_Vision KM'!B5","v":"Tugenden/Motivation"},{"$f":"IF($D$2>0,IF($C$5=\"-\",\"-\",'B_III_E_E3_SpP_Vision KM'!H5),\"-\")","v":"-"},{"$f":"'B_III_E_E4_SpP_Vision NW'!B5","v":"Tugenden/Motivation"},{"$f":"IF($D$2>0,IF($C$5=\"-\",\"-\",'B_III_E_E4_SpP_Vision NW'!H5),\"-\")","v":"-"}]
[null,"Sportkonzepte",null,"Punkte",{"$f":"SUM(D5:D7)","v":0},"SOLL","IST",null,null,null,null,{"$f":"'B_III_E_E1_SpP_V-Visionen'!B6","v":"Sportliche Vereinsvisionen"},{"$f":"IF($D$2>0,IF($C$5=\"-\",\"-\",'B_III_E_E1_SpP_V-Visionen'!H6),\"-\")","v":"-"},{"$f":"'B_III_E_E2_SpP_Spielsys-Vision'!B6","v":"Spielsystemvision"},{"$f":"IF($D$2>0,IF($C$5=\"-\",\"-\",'B_III_E_E2_SpP_Spielsys-Vision'!H6),\"-\")","v":"-"},{"$f":"'B_III_E_E3_SpP_Vision KM'!B6","v":"Spielvision"},{"$f":"IF($D$2>0,IF($C$5=\"-\",\"-\",'B_III_E_E3_SpP_Vision KM'!H6),\"-\")","v":"-"},{"$f":"'B_III_E_E4_SpP_Vision NW'!B6","v":"Spielvision"},{"$f":"IF($D$2>0,IF($C$5=\"-\",\"-\",'B_III_E_E4_SpP_Vision NW'!H6),\"-\")","v":"-"}]
[null,null,null,"Konzept",null,"Die Ebenen",null,null,null,null,null,{"$f":"'B_III_E_E1_SpP_V-Visionen'!B7","v":"Tugenden/Motivation"},{"$f":"IF($D$2>0,IF($C$5=\"-\",\"-\",'B_III_E_E1_SpP_V-Visionen'!H7),\"-\")","v":"-"},{"$f":"'B_III_E_E2_SpP_Spielsys-Vision'!B7","v":"Spielvision"},{"$f":"IF($D$2>0,IF($C$5=\"-\",\"-\",'B_III_E_E2_SpP_Spielsys-Vision'!H7),\"-\")","v":"-"},{"$f":"'B_III_E_E3_SpP_Vision KM'!B7","v":"Ausbildungsvision"},{"$f":"IF($D$2>0,IF($C$5=\"-\",\"-\",'B_III_E_E3_SpP_Vision KM'!H7),\"-\")","v":"-"},{"$f":"'B_III_E_E4_SpP_Vision NW'!B7","v":"Ausbildungsvision"},{"$f":"IF($D$2>0,IF($C$5=\"-\",\"-\",'B_III_E_E4_SpP_Vision NW'!H7),\"-\")","v":"-"}]
[1,{"$f":"'B_III_E Visions Persp'!B4","v":"E. Visionsperspektive"},"-",{"$f":"IF(C5=\"-\",\"-\",IFERROR(($D$2/COUNTIF($C$5:$C$7,\">0\")*(H5/F5)),\"-\"))","v":"-"},{"$f":"D5","v":"-"},{"$f":"IF(C5=\"-\",\"-\",\"100%\")","v":"-"},{"$f":"IF(C5=\"-\",\"-\",'B_III_E Visions Persp'!E2)","v":"-"},{"$f":"IF(C5=1,G5,\"-\")","v":"-"},{"$f":"IFERROR($F$2*C5,0)","v":0},null,null,{"$f":"'B_III_E_E1_SpP_V-Visionen'!B8","v":"Spielsystemvision"},{"$f":"IF($D$2>0,IF($C$5=\"-\",\"-\",'B_III_E_E1_SpP_V-Visionen'!H8),\"-\")","v":"-"},{"$f":"'B_III_E_E2_SpP_Spielsys-Vision'!B8","v":"Ausbildungsvision"},{"$f":"IF($D$2>0,IF($C$5=\"-\",\"-\",'B_III_E_E2_SpP_Spielsys-Vision'!H8),\"-\")","v":"-"},{"$f":"'B_III_E_E3_SpP_Vision KM'!B8","v":"Trainingsvision"},{"$f":"IF($D$2>0,IF($C$5=\"-\",\"-\",'B_III_E_E3_SpP_Vision KM'!H8),\"-\")","v":"-"},{"$f":"'B_III_E_E4_SpP_Vision NW'!B8","v":"Trainingsvision"},{"$f":"IF($D$2>0,IF($C$5=\"-\",\"-\",'B_III_E_E4_SpP_Vision NW'!H8),\"-\")","v":"-"}]
[2,{"$f":"'B_III_F Sport Persp'!$B$4","v":"F. Sportperspektive"},1,0,{"$f":"D6","v":0},{"$f":"IF(C6=\"-\",\"-\",\"100%\")","v":"100%"},{"$f":"IF(C6=\"-\",\"-\",'B_III_F Sport Persp'!E2)","v":0},{"$f":"IF(C6=1,G6,\"-\")","v":0},{"$f":"IFERROR($F$2*C6,0)","v":0},null,null,{"$f":"'B_III_E_E1_SpP_V-Visionen'!B9","v":"Scoutingvision"},{"$f":"IF($D$2>0,IF($C$5=\"-\",\"-\",'B_III_E_E1_SpP_V-Visionen'!H9),\"-\")","v":"-"},{"$f":"'B_III_E_E2_SpP_Spielsys-Vision'!B9","v":"Trainingsvision"},{"$f":"IF($D$2>0,IF($C$5=\"-\",\"-\",'B_III_E_E2_SpP_Spielsys-Vision'!H9),\"-\")","v":"-"},{"$f":"'B_III_E_E3_SpP_Vision KM'!B9","v":"Scoutingvision"},{"$f":"IF($D$2>0,IF($C$5=\"-\",\"-\",'B_III_E_E3_SpP_Vision KM'!H9),\"-\")","v":"-"},{"$f":"'B_III_E_E4_SpP_Vision NW'!B9","v":"Scoutingvision"},{"$f":"IF($D$2>0,IF($C$5=\"-\",\"-\",'B_III_E_E4_SpP_Vision NW'!H9),\"-\")","v":"-"}]
[3,{"$f":"'B_III_G Sportumfeld Persp'!B4","v":"G. Sportumfeldperspektive"},"-","-","-",{"$f":"IF(C7=\"-\",\"-\",\"100%\")","v":"-"},{"$f":"IF(C7=\"-\",\"-\",'B_III_G Sportumfeld Persp'!E2)","v":"-"},"-",0,null,null,{"$f":"'B_III_E_E1_SpP_V-Visionen'!B10","v":"Analysevision"},{"$f":"IF($D$2>0,IF($C$5=\"-\",\"-\",'B_III_E_E1_SpP_V-Visionen'!H10),\"-\")","v":"-"},{"$f":"'B_III_E_E2_SpP_Spielsys-Vision'!B10","v":"Scoutingvision"},{"$f":"IF($D$2>0,IF($C$5=\"-\",\"-\",'B_III_E_E2_SpP_Spielsys-Vision'!H10),\"-\")","v":"-"},{"$f":"'B_III_E_E3_SpP_Vision KM'!B10","v":"Analysevision"},{"$f":"IF($D$2>0,IF($C$5=\"-\",\"-\",'B_III_E_E3_SpP_Vision KM'!H10),\"-\")","v":"-"},{"$f":"'B_III_E_E4_SpP_Vision NW'!B10","v":"Analysevision"},{"$f":"IF($D$2>0,IF($C$5=\"-\",\"-\",'B_III_E_E4_SpP_Vision NW'!H10),\"-\")","v":"-"}]
[4,null,null,null,null,null,null,{"$f":"IF(C8=1,G8,\"-\")","v":"-"},0,null,null,{"$f":"'B_III_E_E1_SpP_V-Visionen'!B11","v":"Therapievisionen"},{"$f":"IF($D$2>0,IF($C$5=\"-\",\"-\",'B_III_E_E1_SpP_V-Visionen'!H11),\"-\")","v":"-"},{"$f":"'B_III_E_E2_SpP_Spielsys-Vision'!B11","v":"Analysevision"},{"$f":"IF($D$2>0,IF($C$5=\"-\",\"-\",'B_III_E_E2_SpP_Spielsys-Vision'!H11),\"-\")","v":"-"},{"$f":"'B_III_E_E3_SpP_Vision KM'!B11","v":"Spieltaktische Visionen"},{"$f":"IF($D$2>0,IF($C$5=\"-\",\"-\",'B_III_E_E3_SpP_Vision KM'!H11),\"-\")","v":"-"},{"$f":"'B_III_E_E4_SpP_Vision NW'!B11","v":"Spieltaktische Visionen"},{"$f":"IF($D$2>0,IF($C$5=\"-\",\"-\",'B_III_E_E4_SpP_Vision NW'!H11),\"-\")","v":"-"}]
[null,null,null,null,null,null,null,null,null,null,null,{"$f":"'B_III_E_E1_SpP_V-Visionen'!B12","v":"Medizinische Abteilung"},{"$f":"IF($D$2>0,IF($C$5=\"-\",\"-\",'B_III_E_E1_SpP_V-Visionen'!H12),\"-\")","v":"-"},{"$f":"'B_III_E_E2_SpP_Spielsys-Vision'!B12","v":"Spielsystemvision_8"},{"$f":"IF($D$2>0,IF($C$5=\"-\",\"-\",'B_III_E_E2_SpP_Spielsys-Vision'!H12),\"-\")","v":"-"},{"$f":"'B_III_E_E3_SpP_Vision KM'!B12","v":"Spielphasen Visionen"},{"$f":"IF($D$2>0,IF($C$5=\"-\",\"-\",'B_III_E_E3_SpP_Vision KM'!H12),\"-\")","v":"-"},{"$f":"'B_III_E_E4_SpP_Vision NW'!B12","v":"Spielphasen Visionen"},{"$f":"IF($D$2>0,IF($C$5=\"-\",\"-\",'B_III_E_E4_SpP_Vision NW'!H12),\"-\")","v":"-"}]
[null,null,null,null,null,null,null,null,null,null,null,{"$f":"'B_III_E_E1_SpP_V-Visionen'!B13","v":"Mentaltrainer"},{"$f":"IF($D$2>0,IF($C$5=\"-\",\"-\",'B_III_E_E1_SpP_V-Visionen'!H13),\"-\")","v":"-"},{"$f":"'B_III_E_E2_SpP_Spielsys-Vision'!B13","v":"Spielsystemvision_9"},{"$f":"IF($D$2>0,IF($C$5=\"-\",\"-\",'B_III_E_E2_SpP_Spielsys-Vision'!H13),\"-\")","v":"-"},{"$f":"'B_III_E_E3_SpP_Vision KM'!B13","v":"Sport-Spielvisionen KM_9"},{"$f":"IF($D$2>0,IF($C$5=\"-\",\"-\",'B_III_E_E3_SpP_Vision KM'!H13),\"-\")","v":"-"},{"$f":"'B_III_E_E4_SpP_Vision NW'!B13","v":"Entwicklungsvisionen"},{"$f":"IF($D$2>0,IF($C$5=\"-\",\"-\",'B_III_E_E4_SpP_Vision NW'!H13),\"-\")","v":"-"}]
[]
[null,null,null,null,null,null,null,null,null,null,{"$f":"$B$6","v":"F. Sportperspektive"},{"$f":"B_III_F_F1_SpP_Vereinssportleit!$B$4","v":"F1. Vereinssportleitsätze"},null,{"$f":"B_III_F_F2_SpP_Spielsystem!$B$4","v":"F2. Spielsystem-Auffassung KM/NW"},null,{"$f":"'B_III_F_F3_SpP_Spiel-Tr-Ausb KM'!$B$4","v":"F3. Spiel-Trainings-Ausbildungsplan KM"},null,{"$f":"'B_III_F_F4_SpP_Spiel-Tr-Ausb NW'!$B$4","v":"F4. Spiel-Trainings-Ausbildungsplan NW"}]
[null,null,null,null,null,null,null,null,null,null,null,{"$f":"B_III_F_F1_SpP_Vereinssportleit!B5","v":"BSpo1 - Ausbildungsstand der Trainer erhöhen"},{"$f":"IF($D$2>0,IF($C$6=\"-\",\"-\",B_III_F_F1_SpP_Vereinssportleit!H5),\"-\")","v":"-"},{"$f":"B_III_F_F2_SpP_Spielsystem!B5","v":"System-Auffassung"},{"$f":"IF($D$2>0,IF($C$6=\"-\",\"-\",B_III_F_F2_SpP_Spielsystem!H5),\"-\")","v":"-"},{"$f":"'B_III_F_F3_SpP_Spiel-Tr-Ausb KM'!B5","v":"Spielplan"},{"$f":"IF($D$2>0,IF($C$6=\"-\",\"-\",'B_III_F_F3_SpP_Spiel-Tr-Ausb KM'!H5),\"-\")","v":"-"},{"$f":"'B_III_F_F4_SpP_Spiel-Tr-Ausb NW'!B5","v":"Trainingsplan"},{"$f":"IF($D$2>0,IF($C$6=\"-\",\"-\",'B_III_F_F4_SpP_Spiel-Tr-Ausb NW'!H5),\"-\")","v":"-"}]
[null,null,null,null,null,null,null,null,null,null,null,{"$f":"B_III_F_F1_SpP_Vereinssportleit!B6","v":"BSpo2 - Quantität der NW-Spieler wird erhöht"},{"$f":"IF($D$2>0,IF($C$6=\"-\",\"-\",B_III_F_F1_SpP_Vereinssportleit!H6),\"-\")","v":"-"},{"$f":"B_III_F_F2_SpP_Spielsystem!B6","v":"System-Auffassung_2"},{"$f":"IF($D$2>0,IF($C$6=\"-\",\"-\",B_III_F_F2_SpP_Spielsystem!H6),\"-\")","v":"-"},{"$f":"'B_III_F_F3_SpP_Spiel-Tr-Ausb KM'!B6","v":"Ausbildungsplan"},{"$f":"IF($D$2>0,IF($C$6=\"-\",\"-\",'B_III_F_F3_SpP_Spiel-Tr-Ausb KM'!H6),\"-\")","v":"-"},{"$f":"'B_III_F_F4_SpP_Spiel-Tr-Ausb NW'!B6","v":"Ausbildungsplan"},{"$f":"IF($D$2>0,IF($C$6=\"-\",\"-\",'B_III_F_F4_SpP_Spiel-Tr-Ausb NW'!H6),\"-\")","v":"-"}]
[null,null,null,null,null,null,null,null,null,null,null,{"$f":"B_III_F_F1_SpP_Vereinssportleit!B7","v":"BSpo3 - Anteil der Eigenbauspieler in KM steigt"},{"$f":"IF($D$2>0,IF($C$6=\"-\",\"-\",B_III_F_F1_SpP_Vereinssportleit!H7),\"-\")","v":"-"},{"$f":"B_III_F_F2_SpP_Spielsystem!B7","v":"System-Auffassung_3"},{"$f":"IF($D$2>0,IF($C$6=\"-\",\"-\",B_III_F_F2_SpP_Spielsystem!H7),\"-\")","v":"-"},{"$f":"'B_III_F_F3_SpP_Spiel-Tr-Ausb KM'!B7","v":"Trainingsplan"},{"$f":"IF($D$2>0,IF($C$6=\"-\",\"-\",'B_III_F_F3_SpP_Spiel-Tr-Ausb KM'!H7),\"-\")","v":"-"},{"$f":"'B_III_F_F4_SpP_Spiel-Tr-Ausb NW'!B7","v":"Spielplan"},{"$f":"IF($D$2>0,IF($C$6=\"-\",\"-\",'B_III_F_F4_SpP_Spiel-Tr-Ausb NW'!H7),\"-\")","v":"-"}]
[null,null,null,null,null,null,null,null,null,null,null,{"$f":"B_III_F_F1_SpP_Vereinssportleit!B8","v":"BSpo4 - Sportlicher Erfolg der KM steigt"},{"$f":"IF($D$2>0,IF($C$6=\"-\",\"-\",B_III_F_F1_SpP_Vereinssportleit!H8),\"-\")","v":"-"},{"$f":"B_III_F_F2_SpP_Spielsystem!B8","v":"System-Auffassung_4"},{"$f":"IF($D$2>0,IF($C$6=\"-\",\"-\",B_III_F_F2_SpP_Spielsystem!H8),\"-\")","v":"-"},{"$f":"'B_III_F_F3_SpP_Spiel-Tr-Ausb KM'!B8","v":"Rahmenbedingung für Trainer verbessern"},{"$f":"IF($D$2>0,IF($C$6=\"-\",\"-\",'B_III_F_F3_SpP_Spiel-Tr-Ausb KM'!H8),\"-\")","v":"-"},{"$f":"'B_III_F_F4_SpP_Spiel-Tr-Ausb NW'!B8","v":"Rahmenbedingung für NW-Trainer verbessern"},{"$f":"IF($D$2>0,IF($C$6=\"-\",\"-\",'B_III_F_F4_SpP_Spiel-Tr-Ausb NW'!H8),\"-\")","v":"-"}]
[null,null,null,null,null,null,null,null,null,null,null,{"$f":"B_III_F_F1_SpP_Vereinssportleit!B9","v":"Leitsätze"},{"$f":"IF($D$2>0,IF($C$6=\"-\",\"-\",B_III_F_F1_SpP_Vereinssportleit!H9),\"-\")","v":"-"},{"$f":"B_III_F_F2_SpP_Spielsystem!B9","v":"System-Auffassung_5"},{"$f":"IF($D$2>0,IF($C$6=\"-\",\"-\",B_III_F_F2_SpP_Spielsystem!H9),\"-\")","v":"-"},{"$f":"'B_III_F_F3_SpP_Spiel-Tr-Ausb KM'!B9","v":"Rahmenbedingung für Spieler verbessern"},{"$f":"IF($D$2>0,IF($C$6=\"-\",\"-\",'B_III_F_F3_SpP_Spiel-Tr-Ausb KM'!H9),\"-\")","v":"-"},{"$f":"'B_III_F_F4_SpP_Spiel-Tr-Ausb NW'!B9","v":"Rahmenbedingung für NW-Spieler verbessern"},{"$f":"IF($D$2>0,IF($C$6=\"-\",\"-\",'B_III_F_F4_SpP_Spiel-Tr-Ausb NW'!H9),\"-\")","v":"-"}]
[null,null,null,null,null,null,null,null,null,null,null,{"$f":"B_III_F_F1_SpP_Vereinssportleit!B10","v":"Qualität der NW wird erhöht"},{"$f":"IF($D$2>0,IF($C$6=\"-\",\"-\",B_III_F_F1_SpP_Vereinssportleit!H10),\"-\")","v":"-"},{"$f":"B_III_F_F2_SpP_Spielsystem!B10","v":"System-Auffassung_6"},{"$f":"IF($D$2>0,IF($C$6=\"-\",\"-\",B_III_F_F2_SpP_Spielsystem!H10),\"-\")","v":"-"},{"$f":"'B_III_F_F3_SpP_Spiel-Tr-Ausb KM'!B10","v":"Spiel-Trainings-Ausbildungsplan KM_6"},{"$f":"IF($D$2>0,IF($C$6=\"-\",\"-\",'B_III_F_F3_SpP_Spiel-Tr-Ausb KM'!H10),\"-\")","v":"-"},{"$f":"'B_III_F_F4_SpP_Spiel-Tr-Ausb NW'!B10","v":"Spiel-Trainings-Ausbildungsplan NW_6"},{"$f":"IF($D$2>0,IF($C$6=\"-\",\"-\",'B_III_F_F4_SpP_Spiel-Tr-Ausb NW'!H10),\"-\")","v":"-"}]
[null,null,null,null,null,null,null,null,null,null,null,{"$f":"B_III_F_F1_SpP_Vereinssportleit!B11","v":"Qualität der KM Spieler wird erhöht"},{"$f":"IF($D$2>0,IF($C$6=\"-\",\"-\",B_III_F_F1_SpP_Vereinssportleit!H11),\"-\")","v":"-"},{"$f":"B_III_F_F2_SpP_Spielsystem!B11","v":"System-Auffassung_7"},{"$f":"IF($D$2>0,IF($C$6=\"-\",\"-\",B_III_F_F2_SpP_Spielsystem!H11),\"-\")","v":"-"},{"$f":"'B_III_F_F3_SpP_Spiel-Tr-Ausb KM'!B11","v":"Spiel-Trainings-Ausbildungsplan KM_7"},{"$f":"IF($D$2>0,IF($C$6=\"-\",\"-\",'B_III_F_F3_SpP_Spiel-Tr-Ausb KM'!H11),\"-\")","v":"-"},{"$f":"'B_III_F_F4_SpP_Spiel-Tr-Ausb NW'!B11","v":"Spiel-Trainings-Ausbildungsplan NW_7"},{"$f":"IF($D$2>0,IF($C$6=\"-\",\"-\",'B_III_F_F4_SpP_Spiel-Tr-Ausb NW'!H11),\"-\")","v":"-"}]
[null,null,null,null,null,null,null,null,null,null,null,{"$f":"B_III_F_F1_SpP_Vereinssportleit!B12","v":"Interesse externer Spieler steigt"},{"$f":"IF($D$2>0,IF($C$6=\"-\",\"-\",B_III_F_F1_SpP_Vereinssportleit!H12),\"-\")","v":"-"},{"$f":"B_III_F_F2_SpP_Spielsystem!B12","v":"System-Auffassung_8"},{"$f":"IF($D$2>0,IF($C$6=\"-\",\"-\",B_III_F_F2_SpP_Spielsystem!H12),\"-\")","v":"-"},{"$f":"'B_III_F_F3_SpP_Spiel-Tr-Ausb KM'!B12","v":"Spiel-Trainings-Ausbildungsplan KM_8"},{"$f":"IF($D$2>0,IF($C$6=\"-\",\"-\",'B_III_F_F3_SpP_Spiel-Tr-Ausb KM'!H12),\"-\")","v":"-"},{"$f":"'B_III_F_F4_SpP_Spiel-Tr-Ausb NW'!B12","v":"Spiel-Trainings-Ausbildungsplan NW_8"},{"$f":"IF($D$2>0,IF($C$6=\"-\",\"-\",'B_III_F_F4_SpP_Spiel-Tr-Ausb NW'!H12),\"-\")","v":"-"}]
[null,null,null,null,null,null,null,null,null,null,null,{"$f":"B_III_F_F1_SpP_Vereinssportleit!B13","v":"Passenden Trainer finden oder entwickeln"},{"$f":"IF($D$2>0,IF($C$6=\"-\",\"-\",B_III_F_F1_SpP_Vereinssportleit!H13),\"-\")","v":"-"},{"$f":"B_III_F_F2_SpP_Spielsystem!B13","v":"System-Auffassung_9"},{"$f":"IF($D$2>0,IF($C$6=\"-\",\"-\",B_III_F_F2_SpP_Spielsystem!H13),\"-\")","v":"-"},{"$f":"'B_III_F_F3_SpP_Spiel-Tr-Ausb KM'!B13","v":"Spiel-Trainings-Ausbildungsplan KM_9"},{"$f":"IF($D$2>0,IF($C$6=\"-\",\"-\",'B_III_F_F3_SpP_Spiel-Tr-Ausb KM'!H13),\"-\")","v":"-"},{"$f":"'B_III_F_F4_SpP_Spiel-Tr-Ausb NW'!B13","v":"Spiel-Trainings-Ausbildungsplan NW_9"},{"$f":"IF($D$2>0,IF($C$6=\"-\",\"-\",'B_III_F_F4_SpP_Spiel-Tr-Ausb NW'!H13),\"-\")","v":"-"}]
[]
[null,null,null,null,null,null,null,null,null,null,{"$f":"$B$7","v":"G. Sportumfeldperspektive"},{"$f":"'B_III_G Sportumfeld Persp'!B5","v":"G1. Sportumfeld"},null,{"$f":"'B_III_G Sportumfeld Persp'!B6","v":"G2. Sportumfeld_2"},null,{"$f":"'B_III_G Sportumfeld Persp'!B7","v":" "},null,{"$f":"'B_III_G Sportumfeld Persp'!B8","v":" "}]
[null,null,null,null,null,null,null,null,null,null,null,{"$f":"B_III_G_G1_SpP_Sportumfeld!B5","v":"Sportumfeld-Test_1"},{"$f":"IF($D$2>0,IF($C$7=\"-\",\"-\",B_III_G_G1_SpP_Sportumfeld!H5),\"-\")","v":"-"},{"$f":"B_III_G_G2_SpP_Sportumfeld_2!B5","v":"Sportumfeld_2-Test_1"},{"$f":"IF($D$2>0,IF($C$7=\"-\",\"-\",B_III_G_G2_SpP_Sportumfeld_2!H5),\"-\")","v":"-"}]
[null,null,null,null,null,null,null,null,null,null,null,{"$f":"B_III_G_G1_SpP_Sportumfeld!B6","v":"Sportumfeld-Test_2"},{"$f":"IF($D$2>0,IF($C$7=\"-\",\"-\",B_III_G_G1_SpP_Sportumfeld!H6),\"-\")","v":"-"},{"$f":"B_III_G_G2_SpP_Sportumfeld_2!B6","v":"Sportumfeld_2-Test_2"},{"$f":"IF($D$2>0,IF($C$7=\"-\",\"-\",B_III_G_G2_SpP_Sportumfeld_2!H6),\"-\")","v":"-"}]
[null,null,null,null,null,null,null,null,null,null,null,{"$f":"B_III_G_G1_SpP_Sportumfeld!B7","v":"Sportumfeld-Test_3"},{"$f":"IF($D$2>0,IF($C$7=\"-\",\"-\",B_III_G_G1_SpP_Sportumfeld!H7),\"-\")","v":"-"},{"$f":"B_III_G_G2_SpP_Sportumfeld_2!B7","v":"Sportumfeld_2-Test_3"},{"$f":"IF($D$2>0,IF($C$7=\"-\",\"-\",B_III_G_G2_SpP_Sportumfeld_2!H7),\"-\")","v":"-"}]
[null,null,null,null,null,null,null,null,null,null,null,{"$f":"B_III_G_G1_SpP_Sportumfeld!B8","v":"Sportumfeld-Test_4"},{"$f":"IF($D$2>0,IF($C$7=\"-\",\"-\",B_III_G_G1_SpP_Sportumfeld!H8),\"-\")","v":"-"},{"$f":"B_III_G_G2_SpP_Sportumfeld_2!B8","v":"Sportumfeld_2-Test_4"},{"$f":"IF($D$2>0,IF($C$7=\"-\",\"-\",B_III_G_G2_SpP_Sportumfeld_2!H8),\"-\")","v":"-"}]
[null,null,null,null,null,null,null,null,null,null,null,{"$f":"B_III_G_G1_SpP_Sportumfeld!B9","v":"Sportumfeld-Test_5"},{"$f":"IF($D$2>0,IF($C$7=\"-\",\"-\",B_III_G_G1_SpP_Sportumfeld!H9),\"-\")","v":"-"},{"$f":"B_III_G_G2_SpP_Sportumfeld_2!B9","v":"Sportumfeld_2-Test_5"},{"$f":"IF($D$2>0,IF($C$7=\"-\",\"-\",B_III_G_G2_SpP_Sportumfeld_2!H9),\"-\")","v":"-"}]
[null,null,null,null,null,null,null,null,null,null,null,{"$f":"B_III_G_G1_SpP_Sportumfeld!B10","v":"Sportumfeld-Test_6"},{"$f":"IF($D$2>0,IF($C$7=\"-\",\"-\",B_III_G_G1_SpP_Sportumfeld!H10),\"-\")","v":"-"},{"$f":"B_III_G_G2_SpP_Sportumfeld_2!B10","v":"Sportumfeld_2-Test_6"},{"$f":"IF($D$2>0,IF($C$7=\"-\",\"-\",B_III_G_G2_SpP_Sportumfeld_2!H10),\"-\")","v":"-"}]
[null,null,null,null,null,null,null,null,null,null,null,{"$f":"B_III_G_G1_SpP_Sportumfeld!B11","v":"Sportumfeld-Test_7"},{"$f":"IF($D$2>0,IF($C$7=\"-\",\"-\",B_III_G_G1_SpP_Sportumfeld!H11),\"-\")","v":"-"},{"$f":"B_III_G_G2_SpP_Sportumfeld_2!B11","v":"Sportumfeld_2-Test_7"},{"$f":"IF($D$2>0,IF($C$7=\"-\",\"-\",B_III_G_G2_SpP_Sportumfeld_2!H11),\"-\")","v":"-"}]
[null,null,null,null,null,null,null,null,null,null,null,{"$f":"B_III_G_G1_SpP_Sportumfeld!B12","v":"Sportumfeld-Test_8"},{"$f":"IF($D$2>0,IF($C$7=\"-\",\"-\",B_III_G_G1_SpP_Sportumfeld!H12),\"-\")","v":"-"},{"$f":"B_III_G_G2_SpP_Sportumfeld_2!B12","v":"Sportumfeld_2-Test_8"},{"$f":"IF($D$2>0,IF($C$7=\"-\",\"-\",B_III_G_G2_SpP_Sportumfeld_2!H12),\"-\")","v":"-"}]
[null,null,null,null,null,null,null,null,null,null,null,{"$f":"B_III_G_G1_SpP_Sportumfeld!B13","v":"Sportumfeld-Test_9"},{"$f":"IF($D$2>0,IF($C$7=\"-\",\"-\",B_III_G_G1_SpP_Sportumfeld!H13),\"-\")","v":"-"},{"$f":"B_III_G_G2_SpP_Sportumfeld_2!B13","v":"Sportumfeld_2-Test_9"},{"$f":"IF($D$2>0,IF($C$7=\"-\",\"-\",B_III_G_G2_SpP_Sportumfeld_2!H13),\"-\")","v":"-"}]

{"sheet":"B_III_E Visions Persp","index":29,"n_rows":8,"n_cols":9,"rows_kept":8,"cut":false,"hidden":true,"merged":[[3,1,3,2],[3,5,3,6],[1,1,1,2],[2,1,2,2],[0,1,0,3],[0,4,0,6]]}
[null,"Strategy Map - Verein 4.0",null,null,{"$f":"B_Konzept!$E$1","v":"Union TTI St. Florian"}]
[null,"III. Sportkonzept",null,{"$f":"B_III_Sport_Konzept!I5","v":0},{"$f":"IFERROR(E3/D2,0)","v":0},{"$f":"IFERROR(D2/G2,0)","v":0},{"$f":"COUNTIF($C$5:$C$8,1)","v":4}]
[null,"Sportkonzept",null,"Punkte",{"$f":"SUM(D5:D8)","v":0},"SOLL","IST"]
[null,"E. Visionsperspektive",null,"Konzept",null,"Die Ebenen"]
[1,{"$f":"'B_III_E_E1_SpP_V-Visionen'!B4","v":"E1. Vereinsvisionen"},1,{"$f":"IF(C5=\"-\",\"-\",IFERROR(($D$2/COUNTIF($C$5:$C$8,\">0\")*(H5/F5)),\"-\"))","v":0},{"$f":"D5","v":0},{"$f":"IF(C5=\"-\",\"-\",\"100%\")","v":"100%"},{"$f":"IF(C5=\"-\",\"-\",'B_III_E_E1_SpP_V-Visionen'!E2)","v":0},{"$f":"IF(C5=1,G5,\"-\")","v":0},{"$f":"IFERROR($F$2*C5,0)","v":0}]
[2,{"$f":"'B_III_E_E2_SpP_Spielsys-Vision'!B4","v":"E2. Spielsystemvisionen KM / NW"},1,{"$f":"IF(C6=\"-\",\"-\",IFERROR(($D$2/COUNTIF($C$5:$C$8,\">0\")*(H6/F6)),\"-\"))","v":0},{"$f":"D6","v":0},{"$f":"IF(C6=\"-\",\"-\",\"100%\")","v":"100%"},{"$f":"IF(C6=\"-\",\"-\",'B_III_E_E2_SpP_Spielsys-Vision'!E2)","v":0},{"$f":"IF(C6=1,G6,\"-\")","v":0},{"$f":"IFERROR($F$2*C6,0)","v":0}]
[3,{"$f":"'B_III_E_E3_SpP_Vision KM'!$B$4","v":"E3. Sport-Spielvisionen KM"},1,{"$f":"IF(C7=\"-\",\"-\",IFERROR(($D$2/COUNTIF($C$5:$C$8,\">0\")*(H7/F7)),\"-\"))","v":0},0,{"$f":"IF(C7=\"-\",\"-\",\"100%\")","v":"100%"},{"$f":"IF(C7=\"-\",\"-\",'B_III_E_E3_SpP_Vision KM'!E2)","v":0},0,0]
[4,{"$f":"'B_III_E_E4_SpP_Vision NW'!$B$4","v":"E4. Sport-Spielvisionen NW"},1,{"$f":"IF(C8=\"-\",\"-\",IFERROR(($D$2/COUNTIF($C$5:$C$8,\">0\")*(H8/F8)),\"-\"))","v":0},0,{"$f":"IF(C8=\"-\",\"-\",\"100%\")","v":"100%"},{"$f":"IF(C8=\"-\",\"-\",'B_III_E_E4_SpP_Vision NW'!E2)","v":0},0,0]

{"sheet":"B_III_E_E1_SpP_V-Visionen","index":30,"n_rows":13,"n_cols":8,"rows_kept":13,"cut":false,"hidden":true,"merged":[[0,1,0,3],[0,4,0,6],[1,1,1,2],[2,1,2,2],[3,1,3,2],[3,5,3,6]]}
[null,"Strategy Map - Verein 4.0",null,null,{"$f":"B_Konzept!$E$1","v":"Union TTI St. Florian"}]
[null,"III. Sportkonzept",null,{"$f":"'B_III_E Visions Persp'!I5","v":0},{"$f":"IFERROR(E3/D2,0)","v":0},{"$f":"IFERROR(D2/G2,0)","v":0},{"$f":"COUNTIF($C$5:$C$13,1)","v":9}]
[null,"E. Visionsperspektiven",null,"Punkte",{"$f":"SUM(D5:D13)","v":0},"SOLL","IST"]
[null,"E1. Vereinsvisionen",null,"Konzept",null,"Die Ebenen"]
[1,"Vereinsvision",1,{"$f":"IF(C5=\"-\",0,IFERROR(($D$2/COUNTIF($C$5:$C$13,\">0\")*(H5/F5)),0))","v":0},{"$f":"IF(C5=1,D5,\"-\")","v":0},{"$f":"IF(C5=\"-\",\"-\",\"100%\")","v":"100%"},0.98,{"$f":"IF($D$2=0,\"-\",IF(C5=1,G5,\"-\"))","v":"-"}]
[2,"Sportliche Vereinsvisionen",1,0,{"$f":"IF(C6=1,D6,\"-\")","v":0},"100%",0.97,{"$f":"IF($D$2=0,\"-\",IF(C6=1,G6,\"-\"))","v":"-"}]
[3,"Tugenden/Motivation",1,{"$f":"IF(C7=\"-\",0,IFERROR(($D$2/COUNTIF($C$5:$C$13,\">0\")*(H7/F7)),0))","v":0},0,{"$f":"IF(C7=\"-\",\"-\",\"100%\")","v":"100%"},0.96,"-"]
[4,"Spielsystemvision",1,{"$f":"IF(C8=\"-\",0,IFERROR(($D$2/COUNTIF($C$5:$C$13,\">0\")*(H8/F8)),0))","v":0},0,{"$f":"IF(C8=\"-\",\"-\",\"100%\")","v":"100%"},0.95,"-"]
[5,"Scoutingvision",1,0,0,"100%",0.94,"-"]
[6,"Analysevision",1,0,0,"100%",0.93,"-"]
[7,"Therapievisionen",1,0,{"$f":"IF(C11=1,D11,\"-\")","v":0},"100%",0.92,"-"]
[8,"Medizinische Abteilung",1,0,{"$f":"IF(C12=1,D12,\"-\")","v":0},"100%",0.91,"-"]
[9,"Mentaltrainer",1,0,0,"100%",0.9,"-"]

{"sheet":"B_III_E_E2_SpP_Spielsys-Vision","index":31,"n_rows":13,"n_cols":8,"rows_kept":13,"cut":false,"hidden":true,"merged":[[0,1,0,3],[0,4,0,6],[1,1,1,2],[2,1,2,2],[3,1,3,2],[3,5,3,6]]}
[null,"Strategy Map - Verein 4.0",null,null,{"$f":"B_Konzept!$E$1","v":"Union TTI St. Florian"}]
[null,"III. Sportkonzept",null,{"$f":"'B_III_E Visions Persp'!I6","v":0},{"$f":"IFERROR(E3/D2,0)","v":0},{"$f":"IFERROR(D2/G2,0)","v":0},{"$f":"COUNTIF($C$5:$C$13,1)","v":9}]
[null,"E. Visionsperspektive",null,"Punkte",{"$f":"SUM(D5:D13)","v":0},"SOLL","IST"]
[null,"E2. Spielsystemvisionen KM / NW",null,"Konzept",null,"Die Ebenen"]
[1,"Tugenden/Motivation",1,{"$f":"IF(C5=\"-\",0,IFERROR(($D$2/COUNTIF($C$5:$C$13,\">0\")*(H5/F5)),0))","v":0},{"$f":"IF(C5=1,D5,\"-\")","v":0},{"$f":"IF(C5=\"-\",\"-\",\"100%\")","v":"100%"},0.88,{"$f":"IF($D$2=0,\"-\",IF(C5=1,G5,\"-\"))","v":"-"}]
[2,"Spielsystemvision",1,0,{"$f":"IF(C6=1,D6,\"-\")","v":0},"100%",0.869999999999999,{"$f":"IF($D$2=0,\"-\",IF(C6=1,G6,\"-\"))","v":"-"}]
[3,"Spielvision",1,{"$f":"IF(C7=\"-\",0,IFERROR(($D$2/COUNTIF($C$5:$C$13,\">0\")*(H7/F7)),0))","v":0},0,{"$f":"IF(C7=\"-\",\"-\",\"100%\")","v":"100%"},0.86,"-"]
[4,"Ausbildungsvision",1,{"$f":"IF(C8=\"-\",0,IFERROR(($D$2/COUNTIF($C$5:$C$13,\">0\")*(H8/F8)),0))","v":0},0,{"$f":"IF(C8=\"-\",\"-\",\"100%\")","v":"100%"},0.85,"-"]
[5,"Trainingsvision",1,0,0,"100%",0.84,"-"]
[6,"Scoutingvision",1,0,0,"100%",0.83,"-"]
[7,"Analysevision",1,0,{"$f":"IF(C11=1,D11,\"-\")","v":0},"100%",0.82,"-"]
[8,"Spielsystemvision_8",1,0,{"$f":"IF(C12=1,D12,\"-\")","v":0},"100%",0.81,"-"]
[9,"Spielsystemvision_9",1,0,0,"100%",0.8,"-"]

{"sheet":"B_III_E_E3_SpP_Vision KM","index":32,"n_rows":13,"n_cols":8,"rows_kept":13,"cut":false,"hidden":true,"merged":[[0,1,0,3],[0,4,0,6],[1,1,1,2],[2,1,2,2],[3,1,3,2],[3,5,3,6]]}
[null,"Strategy Map - Verein 4.0",null,null,{"$f":"B_Konzept!$E$1","v":"Union TTI St. Florian"}]
[null,"III. Sportkonzept",null,{"$f":"'B_III_E Visions Persp'!I7","v":0},{"$f":"IFERROR(E3/D2,0)","v":0},{"$f":"IFERROR(D2/G2,0)","v":0},{"$f":"COUNTIF($C$5:$C$13,1)","v":9}]
[null,"E. Visionsperspektive",null,"Punkte",{"$f":"SUM(D5:D13)","v":0},"SOLL","IST"]
[null,"E3. Sport-Spielvisionen KM",null,"Konzept",null,"Die Ebenen"]
[1,"Tugenden/Motivation",1,{"$f":"IF(C5=\"-\",0,IFERROR(($D$2/COUNTIF($C$5:$C$13,\">0\")*(H5/F5)),0))","v":0},{"$f":"IF(C5=1,D5,\"-\")","v":0},{"$f":"IF(C5=\"-\",\"-\",\"100%\")","v":"100%"},0.78,{"$f":"IF($D$2=0,\"-\",IF(C5=1,G5,\"-\"))","v":"-"}]
[2,"Spielvision",1,0,{"$f":"IF(C6=1,D6,\"-\")","v":0},"100%",0.77,{"$f":"IF($D$2=0,\"-\",IF(C6=1,G6,\"-\"))","v":"-"}]
[3,"Ausbildungsvision",1,{"$f":"IF(C7=\"-\",0,IFERROR(($D$2/COUNTIF($C$5:$C$13,\">0\")*(H7/F7)),0))","v":0},0,{"$f":"IF(C7=\"-\",\"-\",\"100%\")","v":"100%"},0.76,"-"]
[4,"Trainingsvision",1,{"$f":"IF(C8=\"-\",0,IFERROR(($D$2/COUNTIF($C$5:$C$13,\">0\")*(H8/F8)),0))","v":0},0,{"$f":"IF(C8=\"-\",\"-\",\"100%\")","v":"100%"},0.75,"-"]
[5,"Scoutingvision",1,0,0,"100%",0.74,"-"]
[6,"Analysevision",1,0,0,"100%",0.73,"-"]
[7,"Spieltaktische Visionen",1,0,{"$f":"IF(C11=1,D11,\"-\")","v":0},"100%",0.72,"-"]
[8,"Spielphasen Visionen",1,0,{"$f":"IF(C12=1,D12,\"-\")","v":0},"100%",0.71,"-"]
[9,"Sport-Spielvisionen KM_9",1,0,0,"100%",0.7,"-"]

{"sheet":"B_III_E_E4_SpP_Vision NW","index":33,"n_rows":13,"n_cols":8,"rows_kept":13,"cut":false,"hidden":true,"merged":[[0,1,0,3],[0,4,0,6],[1,1,1,2],[2,1,2,2],[3,1,3,2],[3,5,3,6]]}
[null,"Strategy Map - Verein 4.0",null,null,{"$f":"B_Konzept!$E$1","v":"Union TTI St. Florian"}]
[null,"III. Sportkonzept",null,{"$f":"'B_III_E Visions Persp'!I8","v":0},{"$f":"IFERROR(E3/D2,0)","v":0},{"$f":"IFERROR(D2/G2,0)","v":0},{"$f":"COUNTIF($C$5:$C$13,1)","v":9}]
[null,"E. Visionsperspektive",null,"Punkte",{"$f":"SUM(D5:D13)","v":0},"SOLL","IST"]
[null,"E4. Sport-Spielvisionen NW",null,"Konzept",null,"Die Ebenen"]
[1,"Tugenden/Motivation",1,{"$f":"IF(C5=\"-\",0,IFERROR(($D$2/COUNTIF($C$5:$C$13,\">0\")*(H5/F5)),0))","v":0},{"$f":"IF(C5=1,D5,\"-\")","v":0},{"$f":"IF(C5=\"-\",\"-\",\"100%\")","v":"100%"},0.68,{"$f":"IF($D$2=0,\"-\",IF(C5=1,G5,\"-\"))","v":"-"}]
[2,"Spielvision",1,0,{"$f":"IF(C6=1,D6,\"-\")","v":0},"100%",0.67,{"$f":"IF($D$2=0,\"-\",IF(C6=1,G6,\"-\"))","v":"-"}]
[3,"Ausbildungsvision",1,{"$f":"IF(C7=\"-\",0,IFERROR(($D$2/COUNTIF($C$5:$C$13,\">0\")*(H7/F7)),0))","v":0},0,{"$f":"IF(C7=\"-\",\"-\",\"100%\")","v":"100%"},0.66,"-"]
[4,"Trainingsvision",1,{"$f":"IF(C8=\"-\",0,IFERROR(($D$2/COUNTIF($C$5:$C$13,\">0\")*(H8/F8)),0))","v":0},0,{"$f":"IF(C8=\"-\",\"-\",\"100%\")","v":"100%"},0.65,"-"]
[5,"Scoutingvision",1,0,0,"100%",0.64,"-"]
[6,"Analysevision",1,0,0,"100%",0.63,"-"]
[7,"Spieltaktische Visionen",1,0,{"$f":"IF(C11=1,D11,\"-\")","v":0},"100%",0.62,"-"]
[8,"Spielphasen Visionen",1,0,{"$f":"IF(C12=1,D12,\"-\")","v":0},"100%",0.61,"-"]
[9,"Entwicklungsvisionen",1,0,0,"100%",0.6,"-"]

{"sheet":"B_III_F Sport Persp","index":34,"n_rows":8,"n_cols":9,"rows_kept":8,"cut":false,"hidden":false,"merged":[[1,1,1,2],[2,1,2,2],[3,5,3,6],[3,1,3,2],[0,1,0,3],[0,4,0,6]]}
[null,"Strategy Map - Verein 4.0",null,null,{"$f":"B_Konzept!$E$1","v":"Union TTI St. Florian"}]
[null,"III. Sportkonzept",null,{"$f":"B_III_Sport_Konzept!I6","v":0},{"$f":"IFERROR(E3/D2,0)","v":0},{"$f":"IFERROR(D2/G2,0)","v":0},{"$f":"COUNTIF($C$5:$C$8,1)","v":1}]
[null,"Sportkonzept",null,"Punkte",{"$f":"SUM(D5:D8)","v":0},"SOLL","IST"]
[null,"F. Sportperspektive",null,"Konzept",null,"Die Ebenen"]
[1,{"$f":"B_III_F_F1_SpP_Vereinssportleit!$B$4","v":"F1. Vereinssportleitsätze"},1,{"$f":"IF(C5=\"-\",\"-\",IFERROR(($D$2/COUNTIF($C$5:$C$8,\">0\")*(H5/F5)),\"-\"))","v":0},{"$f":"D5","v":0},{"$f":"IF(C5=\"-\",\"-\",\"100%\")","v":"100%"},{"$f":"IF(C5=1,B_III_F_F1_SpP_Vereinssportleit!$E$2,\"-\")","v":0},{"$f":"IF(C5=1,G5,\"-\")","v":0},{"$f":"IFERROR($F$2*C5,0)","v":0}]
[2,{"$f":"B_III_F_F2_SpP_Spielsystem!$B$4","v":"F2. Spielsystem-Auffassung KM/NW"},"-",{"$f":"IF(C6=\"-\",\"-\",IFERROR(($D$2/COUNTIF($C$5:$C$8,\">0\")*(H6/F6)),\"-\"))","v":"-"},{"$f":"D6","v":"-"},{"$f":"IF(C6=\"-\",\"-\",\"100%\")","v":"-"},{"$f":"IF(C6=\"-\",\"-\",B_III_F_F2_SpP_Spielsystem!$E$2)","v":"-"},{"$f":"IF(C6=1,G6,\"-\")","v":"-"},{"$f":"IFERROR($F$2*C6,0)","v":0}]
[3,{"$f":"'B_III_F_F3_SpP_Spiel-Tr-Ausb KM'!$B$4","v":"F3. Spiel-Trainings-Ausbildungsplan KM"},"-",{"$f":"IF(C7=\"-\",\"-\",IFERROR(($D$2/COUNTIF($C$5:$C$8,\">0\")*(H7/F7)),\"-\"))","v":"-"},"-",{"$f":"IF(C7=\"-\",\"-\",\"100%\")","v":"-"},{"$f":"IF(C7=\"-\",\"-\",'B_III_F_F3_SpP_Spiel-Tr-Ausb KM'!$E$2)","v":"-"},"-",0]
[4,{"$f":"'B_III_F_F4_SpP_Spiel-Tr-Ausb NW'!$B$4","v":"F4. Spiel-Trainings-Ausbildungsplan NW"},"-",{"$f":"IF(C8=\"-\",\"-\",IFERROR(($D$2/COUNTIF($C$5:$C$8,\">0\")*(H8/F8)),\"-\"))","v":"-"},"-",{"$f":"IF(C8=\"-\",\"-\",\"100%\")","v":"-"},{"$f":"IF(C8=\"-\",\"-\",'B_III_F_F4_SpP_Spiel-Tr-Ausb NW'!$E$2)","v":"-"},"-",0]

{"sheet":"B_III_F_F1_SpP_Vereinssportleit","index":35,"n_rows":13,"n_cols":8,"rows_kept":13,"cut":false,"hidden":false,"merged":[[1,1,1,2],[2,1,2,2],[3,5,3,6],[3,1,3,2],[0,1,0,3],[0,4,0,6]]}
[null,"Strategy Map - Verein 4.0",null,null,{"$f":"B_Konzept!$E$1","v":"Union TTI St. Florian"}]
[null,"III. Sportkonzept",null,{"$f":"'B_III_F Sport Persp'!$I$5","v":0},{"$f":"IFERROR(E3/D2,0)","v":0},{"$f":"IFERROR(D2/G2,0)","v":0},{"$f":"COUNTIF($C$5:$C$8,1)","v":4}]
[null,"Sportkonzept",null,"Punkte",{"$f":"SUM(D5:D8)","v":0},"SOLL","IST"]
[null,"F1. Vereinssportleitsätze",null,"Konzept","Richtwerte","Die Ebenen"]
[1,"BSpo1 - Ausbildungsstand der Trainer erhöhen",1,{"$f":"IF(C5=\"-\",0,IFERROR(($D$2/COUNTIF($C$5:$C$8,\">0\")*(H5/F5)),0))","v":0},{"$f":"IF(C5=1,D5,\"-\")","v":0},1,0,{"$f":"IF($D$2=0,\"-\",IF(C5=1,G5,\"-\"))","v":"-"}]
[2,"BSpo2 - Quantität der NW-Spieler wird erhöht",1,{"$f":"IF(C6=\"-\",0,IFERROR(($D$2/COUNTIF($C$5:$C$8,\">0\")*(H6/F6)),0))","v":0},0,1,0,{"$f":"IF($D$2=0,\"-\",IF(C6=1,G6,\"-\"))","v":"-"}]
[3,"BSpo3 - Anteil der Eigenbauspieler in KM steigt",1,{"$f":"IF(C7=\"-\",0,IFERROR(($D$2/COUNTIF($C$5:$C$8,\">0\")*(H7/F7)),0))","v":0},0,1,0,"-"]
[4,"BSpo4 - Sportlicher Erfolg der KM steigt",1,{"$f":"IF(C8=\"-\",0,IFERROR(($D$2/COUNTIF($C$5:$C$8,\">0\")*(H8/F8)),0))","v":0},0,1,0,"-"]
[5,"Leitsätze","-",{"$f":"IF(C9=\"-\",0,IFERROR(($D$2/COUNTIF($C$5:$C$13,\">0\")*(H9/F9)),0))","v":0},"-",1,0,"-"]
[6,"Qualität der NW wird erhöht","-",0,"-",1,0,"-"]
[7,"Qualität der KM Spieler wird erhöht","-",0,"-",1,0,"-"]
[8,"Interesse externer Spieler steigt","-",0,"-",1,0,"-"]
[9,"Passenden Trainer finden oder entwickeln","-",0,"-",1,0,"-"]

{"sheet":"B_III_F_F2_SpP_Spielsystem","index":36,"n_rows":13,"n_cols":8,"rows_kept":13,"cut":false,"hidden":true,"merged":[[1,1,1,2],[2,1,2,2],[3,5,3,6],[3,1,3,2],[0,1,0,3],[0,4,0,6]]}
[null,"Strategy Map - Verein 4.0",null,null,{"$f":"B_Konzept!$E$1","v":"Union TTI St. Florian"}]
[null,"III. Sportkonzept",null,{"$f":"'B_III_F Sport Persp'!$I$6","v":0},{"$f":"IFERROR(E3/D2,0)","v":0},{"$f":"IFERROR(D2/G2,0)","v":0},{"$f":"COUNTIF($C$5:$C$13,1)","v":9}]
[null,"Sportkonzept",null,"Punkte",{"$f":"SUM(D5:D13)","v":0},"SOLL","IST"]
[null,"F2. Spielsystem-Auffassung KM/NW",null,"Konzept",null,"Die Ebenen"]
[1,"System-Auffassung",1,{"$f":"IF(C5=\"-\",0,IFERROR(($D$2/COUNTIF($C$5:$C$13,\">0\")*(H5/F5)),0))","v":0},{"$f":"IF(C5=1,D5,\"-\")","v":0},1,0.88,{"$f":"IF($D$2=0,\"-\",IF(C5=1,G5,\"-\"))","v":"-"}]
[2,"System-Auffassung_2",1,0,0,1,0.869999999999999,{"$f":"IF($D$2=0,\"-\",IF(C6=1,G6,\"-\"))","v":"-"}]
[3,"System-Auffassung_3",1,0,0,1,0.86,"-"]
[4,"System-Auffassung_4",1,0,0,1,0.85,"-"]
[5,"System-Auffassung_5",1,0,0,1,0.84,"-"]
[6,"System-Auffassung_6",1,0,0,1,0.83,"-"]
[7,"System-Auffassung_7",1,0,0,1,0.82,"-"]
[8,"System-Auffassung_8",1,0,0,1,0.81,"-"]
[9,"System-Auffassung_9",1,0,0,1,0.8,"-"]

{"sheet":"B_III_F_F3_SpP_Spiel-Tr-Ausb KM","index":37,"n_rows":13,"n_cols":8,"rows_kept":13,"cut":false,"hidden":true,"merged":[[1,1,1,2],[2,1,2,2],[3,5,3,6],[3,1,3,2],[0,1,0,3],[0,4,0,6]]}
[null,"Strategy Map - Verein 4.0",null,null,{"$f":"B_Konzept!$E$1","v":"Union TTI St. Florian"}]
[null,"III. Sportkonzept",null,{"$f":"'B_III_F Sport Persp'!$I$7","v":0},{"$f":"IFERROR(E3/D2,0)","v":0},{"$f":"IFERROR(D2/G2,0)","v":0},{"$f":"COUNTIF($C$5:$C$13,1)","v":9}]
[null,"Sportkonzept",null,"Punkte",{"$f":"SUM(D5:D13)","v":0},"SOLL","IST"]
[null,"F3. Spiel-Trainings-Ausbildungsplan KM",null,"Konzept",null,"Die Ebenen"]
[1,"Spielplan",1,{"$f":"IF(C5=\"-\",0,IFERROR(($D$2/COUNTIF($C$5:$C$13,\">0\")*(H5/F5)),0))","v":0},{"$f":"IF(C5=1,D5,\"-\")","v":0},1,0.78,{"$f":"IF($D$2=0,\"-\",IF(C5=1,G5,\"-\"))","v":"-"}]
[2,"Ausbildungsplan",1,0,0,1,0.77,{"$f":"IF($D$2=0,\"-\",IF(C6=1,G6,\"-\"))","v":"-"}]
[3,"Trainingsplan",1,0,0,1,0.76,"-"]
[4,"Rahmenbedingung für Trainer verbessern",1,0,0,1,0.75,"-"]
[5,"Rahmenbedingung für Spieler verbessern",1,0,0,1,0.74,"-"]
[6,"Spiel-Trainings-Ausbildungsplan KM_6",1,0,0,1,0.73,"-"]
[7,"Spiel-Trainings-Ausbildungsplan KM_7",1,0,0,1,0.72,"-"]
[8,"Spiel-Trainings-Ausbildungsplan KM_8",1,0,0,1,0.71,"-"]
[9,"Spiel-Trainings-Ausbildungsplan KM_9",1,0,0,1,0.7,"-"]

{"sheet":"B_III_F_F4_SpP_Spiel-Tr-Ausb NW","index":38,"n_rows":13,"n_cols":8,"rows_kept":13,"cut":false,"hidden":true,"merged":[[1,1,1,2],[2,1,2,2],[3,5,3,6],[3,1,3,2],[0,1,0,3],[0,4,0,6]]}
[null,"Strategy Map - Verein 4.0",null,null,{"$f":"B_Konzept!$E$1","v":"Union TTI St. Florian"}]
[null,"III. Sportkonzept",null,{"$f":"'B_III_F Sport Persp'!$I$8","v":0},{"$f":"IFERROR(E3/D2,0)","v":0},{"$f":"IFERROR(D2/G2,0)","v":0},{"$f":"COUNTIF($C$5:$C$13,1)","v":9}]
[null,"Sportkonzept",null,"Punkte",{"$f":"SUM(D5:D13)","v":0},"SOLL","IST"]
[null,"F4. Spiel-Trainings-Ausbildungsplan NW",null,"Konzept",null,"Die Ebenen"]
[1,"Trainingsplan",1,{"$f":"IF(C5=\"-\",0,IFERROR(($D$2/COUNTIF($C$5:$C$13,\">0\")*(H5/F5)),0))","v":0},{"$f":"IF(C5=1,D5,\"-\")","v":0},1,0.68,{"$f":"IF($D$2=0,\"-\",IF(C5=1,G5,\"-\"))","v":"-"}]
[2,"Ausbildungsplan",1,0,0,1,0.67,{"$f":"IF($D$2=0,\"-\",IF(C6=1,G6,\"-\"))","v":"-"}]
[3,"Spielplan",1,0,0,1,0.66,"-"]
[4,"Rahmenbedingung für NW-Trainer verbessern",1,0,0,1,0.65,"-"]
[5,"Rahmenbedingung für NW-Spieler verbessern",1,0,0,1,0.64,"-"]
[6,"Spiel-Trainings-Ausbildungsplan NW_6",1,0,0,1,0.63,"-"]
[7,"Spiel-Trainings-Ausbildungsplan NW_7",1,0,0,1,0.62,"-"]
[8,"Spiel-Trainings-Ausbildungsplan NW_8",1,0,0,1,0.61,"-"]
[9,"Spiel-Trainings-Ausbildungsplan NW_9",1,0,0,1,0.6,"-"]

{"sheet":"B_III_G Sportumfeld Persp","index":39,"n_rows":8,"n_cols":9,"rows_kept":8,"cut":false,"hidden":true,"merged":[[1,1,1,2],[2,1,2,2],[3,1,3,2],[3,5,3,6],[0,1,0,3],[0,4,0,6]]}
[null,"Strategy Map - Verein 4.0",null,null,{"$f":"B_Konzept!$E$1","v":"Union TTI St. Florian"}]
[null,"III. Sportkonzept",null,{"$f":"B_III_Sport_Konzept!I7","v":0},{"$f":"IFERROR(E3/D2,0)","v":0},{"$f":"IFERROR(D2/G2,0)","v":0},{"$f":"COUNTIF($C$5:$C$8,1)","v":2}]
[null,"Sportkonzept",null,"Punkte",{"$f":"SUM(D5:D8)","v":0},"SOLL","IST"]
[null,"G. Sportumfeldperspektive",null,"Konzept",null,"Die Ebenen"]
[1,{"$f":"B_III_G_G1_SpP_Sportumfeld!B4","v":"G1. Sportumfeld"},1,{"$f":"IF(C5=\"-\",\"-\",IFERROR(($D$2/COUNTIF($C$5:$C$8,\">0\")*(H5/F5)),\"-\"))","v":0},{"$f":"D5","v":0},{"$f":"IF(C5=\"-\",\"-\",\"100%\")","v":"100%"},{"$f":"IF(C5=\"-\",\"-\",B_III_G_G1_SpP_Sportumfeld!E2)","v":0},{"$f":"IF(C5=1,G5,\"-\")","v":0},{"$f":"IFERROR($F$2*C5,0)","v":0}]
[2,{"$f":"B_III_G_G2_SpP_Sportumfeld_2!B4","v":"G2. Sportumfeld_2"},1,{"$f":"IF(C6=\"-\",\"-\",IFERROR(($D$2/COUNTIF($C$5:$C$8,\">0\")*(H6/F6)),\"-\"))","v":0},{"$f":"D6","v":0},{"$f":"IF(C6=\"-\",\"-\",\"100%\")","v":"100%"},{"$f":"IF(C6=\"-\",\"-\",B_III_G_G2_SpP_Sportumfeld_2!E2)","v":0},{"$f":"IF(C6=1,G6,\"-\")","v":0},{"$f":"IFERROR($F$2*C6,0)","v":0}]
[3," ","-","-","-",{"$f":"IF(C7=\"-\",\"-\",\"100%\")","v":"-"},null,"-",0]
[4," ","-","-","-",{"$f":"IF(C8=\"-\",\"-\",\"100%\")","v":"-"},null,"-",0]

{"sheet":"B_III_G_G1_SpP_Sportumfeld","index":40,"n_rows":13,"n_cols":8,"rows_kept":13,"cut":false,"hidden":true,"merged":[[0,1,0,3],[0,4,0,6],[1,1,1,2],[2,1,2,2],[3,1,3,2],[3,5,3,6]]}
[null,"Strategy Map - Verein 4.0",null,null,{"$f":"B_Konzept!$E$1","v":"Union TTI St. Florian"}]
[null,"III. Sportkonzept",null,{"$f":"'B_III_G Sportumfeld Persp'!I5","v":0},{"$f":"IFERROR(E3/D2,0)","v":0},{"$f":"IFERROR(D2/G2,0)","v":0},{"$f":"COUNTIF($C$5:$C$13,1)","v":9}]
[null,"Sportkonzept",null,"Punkte",{"$f":"SUM(D5:D13)","v":0},"SOLL","IST"]
[null,"G1. Sportumfeld",null,"Konzept",null,"Die Ebenen"]
[1,"Sportumfeld-Test_1",1,{"$f":"IF(C5=\"-\",0,IFERROR(($D$2/COUNTIF($C$5:$C$13,\">0\")*(H5/F5)),0))","v":0},{"$f":"IF(C5=1,D5,\"-\")","v":0},1,0.98,{"$f":"IF($D$2=0,\"-\",IF(C5=1,G5,\"-\"))","v":"-"}]
[2,"Sportumfeld-Test_2",1,0,0,1,0.97,{"$f":"IF($D$2=0,\"-\",IF(C6=1,G6,\"-\"))","v":"-"}]
[3,"Sportumfeld-Test_3",1,0,0,1,0.96,"-"]
[4,"Sportumfeld-Test_4",1,0,0,1,0.95,"-"]
[5,"Sportumfeld-Test_5",1,0,0,1,0.94,"-"]
[6,"Sportumfeld-Test_6",1,0,0,1,0.93,"-"]
[7,"Sportumfeld-Test_7",1,0,0,1,0.92,"-"]
[8,"Sportumfeld-Test_8",1,0,0,1,0.91,"-"]
[9,"Sportumfeld-Test_9",1,0,0,1,0.9,"-"]

{"sheet":"B_III_G_G2_SpP_Sportumfeld_2","index":41,"n_rows":13,"n_cols":8,"rows_kept":13,"cut":false,"hidden":true,"merged":[[0,1,0,3],[0,4,0,6],[1,1,1,2],[2,1,2,2],[3,1,3,2],[3,5,3,6]]}
[null,"Strategy Map - Verein 4.0",null,null,{"$f":"B_Konzept!$E$1","v":"Union TTI St. Florian"}]
[null,"III. Sportkonzept",null,{"$f":"'B_III_G Sportumfeld Persp'!I6","v":0},{"$f":"IFERROR(E3/D2,0)","v":0},{"$f":"IFERROR(D2/G2,0)","v":0},{"$f":"COUNTIF($C$5:$C$13,1)","v":9}]
[null,"Sportkonzept",null,"Punkte",{"$f":"SUM(D5:D13)","v":0},"SOLL","IST"]
[null,"G2. Sportumfeld_2",null,"Konzept",null,"Die Ebenen"]
[1,"Sportumfeld_2-Test_1",1,{"$f":"IF(C5=\"-\",0,IFERROR(($D$2/COUNTIF($C$5:$C$13,\">0\")*(H5/F5)),0))","v":0},{"$f":"IF(C5=1,D5,\"-\")","v":0},1,0.88,{"$f":"IF($D$2=0,\"-\",IF(C5=1,G5,\"-\"))","v":"-"}]
[2,"Sportumfeld_2-Test_2",1,0,0,1,0.869999999999999,{"$f":"IF($D$2=0,\"-\",IF(C6=1,G6,\"-\"))","v":"-"}]
[3,"Sportumfeld_2-Test_3",1,0,0,1,0.86,"-"]
[4,"Sportumfeld_2-Test_4",1,0,0,1,0.85,"-"]
[5,"Sportumfeld_2-Test_5",1,0,0,1,0.84,"-"]
[6,"Sportumfeld_2-Test_6",1,0,0,1,0.83,"-"]
[7,"Sportumfeld_2-Test_7",1,0,0,1,0.82,"-"]
[8,"Sportumfeld_2-Test_8",1,0,0,1,0.81,"-"]
[9,"Sportumfeld_2-Test_9",1,0,0,1,0.8,"-"]

{"sheet":"B_IV_Vermarktungs_Konzept","index":42,"n_rows":32,"n_cols":21,"rows_kept":32,"cut":false,"hidden":false,"merged":[[1,1,1,2],[2,1,2,2],[0,1,0,3],[0,4,0,6],[3,1,3,2],[3,5,3,6]]}
[null,"Strategy Map - Verein 4.0",null,null,{"$f":"B_Konzept!$E$1","v":"Union TTI St. Florian"},null,null,null,null,null,{"$f":"B5","v":"H. Öffentlichkeitsperspektive"},{"$f":"'B_IV_H_H1_Öffentliche Darst'!$B$4","v":"H1. Öffentliche Darstellung"},null,{"$f":"'B_IV_H_H2_Öffentlichkeits-PR'!$B$4","v":"H2. Medien/Öffentlichkeitsarbeit"},null,{"$f":"B_IV_H_H3_Kommunikation!$B$4","v":"H3. Kommunikation"},null,{"$f":"'B_IV_H_H4_Veranstaltung-Events'!$B$4","v":"H4. Veranstaltungen-Events"},null,{"$f":"'B_IV_H_H5_Benchmark Verm'!B4","v":"H5. Benchmark BVerm"}]
[null,"IV. Vermarktungskonzept",null,{"$f":"B_Konzept!I8","v":0},{"$f":"IFERROR(E3/D2,0)","v":0},{"$f":"IFERROR(D2/G2,0)","v":0},{"$f":"COUNTIF($C$5:$C$8,1)","v":1},null,null,null,null,{"$f":"'B_IV_H_H1_Öffentliche Darst'!B5","v":"Grundstrategie"},{"$f":"IF($D$2>0,IF($C$5=\"-\",\"-\",'B_IV_H_H1_Öffentliche Darst'!H5),\"-\")","v":"-"},{"$f":"'B_IV_H_H2_Öffentlichkeits-PR'!B5","v":"Vereinswebsite"},{"$f":"IF($D$2>0,IF($C$5=\"-\",\"-\",'B_IV_H_H2_Öffentlichkeits-PR'!H5),\"-\")","v":"-"},{"$f":"B_IV_H_H3_Kommunikation!B5","v":"Kommunikation_1"},{"$f":"IF($D$2>0,IF($C$5=\"-\",\"-\",B_IV_H_H3_Kommunikation!H5),\"-\")","v":"-"},{"$f":"'B_IV_H_H4_Veranstaltung-Events'!B5","v":"Musterevent_1"},{"$f":"IF($D$2>0,IF($C$5=\"-\",\"-\",'B_IV_H_H4_Veranstaltung-Events'!H5),\"-\")","v":"-"},{"$f":"'B_IV_H_H5_Benchmark Verm'!$B5","v":"BMar1 - Mitgliederzahlen steigen"},{"$f":"IF($D$2>0,IF($C$5=\"-\",\"-\",'B_IV_H_H5_Benchmark Verm'!H5),\"-\")","v":"-"}]
[null,"Vermarktungskonzepte",null,"Punkte",{"$f":"SUM(D5:D7)","v":0},"SOLL","IST",null,null,null,null,{"$f":"'B_IV_H_H1_Öffentliche Darst'!B6","v":"Positionierung"},{"$f":"IF($D$2>0,IF($C$5=\"-\",\"-\",'B_IV_H_H1_Öffentliche Darst'!H6),\"-\")","v":"-"},{"$f":"'B_IV_H_H2_Öffentlichkeits-PR'!B6","v":"Verbandswebsite"},{"$f":"IF($D$2>0,IF($C$5=\"-\",\"-\",'B_IV_H_H2_Öffentlichkeits-PR'!H6),\"-\")","v":"-"},{"$f":"B_IV_H_H3_Kommunikation!B6","v":"Kommunikation_2"},{"$f":"IF($D$2>0,IF($C$5=\"-\",\"-\",B_IV_H_H3_Kommunikation!H6),\"-\")","v":"-"},{"$f":"'B_IV_H_H4_Veranstaltung-Events'!B6","v":"Musterevent_2"},{"$f":"IF($D$2>0,IF($C$5=\"-\",\"-\",'B_IV_H_H4_Veranstaltung-Events'!H6),\"-\")","v":"-"},{"$f":"'B_IV_H_H5_Benchmark Verm'!$B6","v":"BMar2 - Anteil Freiwilligenarbeit steigt"},{"$f":"IF($D$2>0,IF($C$5=\"-\",\"-\",'B_IV_H_H5_Benchmark Verm'!H6),\"-\")","v":"-"}]
[null,null,null,"Konzept",null,"Die Ebenen",null,null,null,null,null,{"$f":"'B_IV_H_H1_Öffentliche Darst'!B7","v":"Darstellung nach Außen"},{"$f":"IF($D$2>0,IF($C$5=\"-\",\"-\",'B_IV_H_H1_Öffentliche Darst'!H7),\"-\")","v":"-"},{"$f":"'B_IV_H_H2_Öffentlichkeits-PR'!B7","v":"Soziale Medien"},{"$f":"IF($D$2>0,IF($C$5=\"-\",\"-\",'B_IV_H_H2_Öffentlichkeits-PR'!H7),\"-\")","v":"-"},{"$f":"B_IV_H_H3_Kommunikation!B7","v":"Kommunikation_3"},{"$f":"IF($D$2>0,IF($C$5=\"-\",\"-\",B_IV_H_H3_Kommunikation!H7),\"-\")","v":"-"},{"$f":"'B_IV_H_H4_Veranstaltung-Events'!B7","v":"Musterevent_3"},{"$f":"IF($D$2>0,IF($C$5=\"-\",\"-\",'B_IV_H_H4_Veranstaltung-Events'!H7),\"-\")","v":"-"},{"$f":"'B_IV_H_H5_Benchmark Verm'!$B7","v":"BMar3 - Ausschöpfung Marketingkanäle"},{"$f":"IF($D$2>0,IF($C$5=\"-\",\"-\",'B_IV_H_H5_Benchmark Verm'!H7),\"-\")","v":"-"}]
[1,{"$f":"'B_IV_H Öffentlichkeitsarb Persp'!B4","v":"H. Öffentlichkeitsperspektive"},1,{"$f":"IF(C5=\"-\",\"-\",IFERROR(($D$2/COUNTIF($C$5:$C$7,\">0\")*(H5/F5)),\"-\"))","v":0},{"$f":"D5","v":0},{"$f":"IF(C5=\"-\",\"-\",\"100%\")","v":"100%"},{"$f":"IF(C5=\"-\",\"-\",'B_IV_H Öffentlichkeitsarb Persp'!E2)","v":0},{"$f":"IF(C5=1,G5,\"-\")","v":0},{"$f":"IFERROR($F$2*C5,0)","v":0},null,null,{"$f":"'B_IV_H_H1_Öffentliche Darst'!B8","v":"Selbstbild des Vereins"},{"$f":"IF($D$2>0,IF($C$5=\"-\",\"-\",'B_IV_H_H1_Öffentliche Darst'!H8),\"-\")","v":"-"},{"$f":"'B_IV_H_H2_Öffentlichkeits-PR'!B8","v":"Spieltaginformation"},{"$f":"IF($D$2>0,IF($C$5=\"-\",\"-\",'B_IV_H_H2_Öffentlichkeits-PR'!H8),\"-\")","v":"-"},{"$f":"B_IV_H_H3_Kommunikation!B8","v":"Kommunikation_4"},{"$f":"IF($D$2>0,IF($C$5=\"-\",\"-\",B_IV_H_H3_Kommunikation!H8),\"-\")","v":"-"},{"$f":"'B_IV_H_H4_Veranstaltung-Events'!B8","v":"Musterevent_4"},{"$f":"IF($D$2>0,IF($C$5=\"-\",\"-\",'B_IV_H_H4_Veranstaltung-Events'!H8),\"-\")","v":"-"},{"$f":"'B_IV_H_H5_Benchmark Verm'!B8","v":"Bessere Argumente für Subventionen"},{"$f":"IF($D$2>0,IF($C$5=\"-\",\"-\",'B_IV_H_H5_Benchmark Verm'!H8),\"-\")","v":"-"}]
[2,{"$f":"'B_IV_I Kommunikations Persp'!B4","v":"I. Kommunikationsperspektive"},"-",{"$f":"IF(C6=\"-\",\"-\",IFERROR(($D$2/COUNTIF($C$5:$C$7,\">0\")*(H6/F6)),\"-\"))","v":"-"},{"$f":"D6","v":"-"},{"$f":"IF(C6=\"-\",\"-\",\"100%\")","v":"-"},{"$f":"IF(C6=\"-\",\"-\",'B_IV_I Kommunikations Persp'!E2)","v":"-"},{"$f":"IF(C6=1,G6,\"-\")","v":"-"},{"$f":"IFERROR($F$2*C6,0)","v":0},null,null,{"$f":"'B_IV_H_H1_Öffentliche Darst'!B9","v":"Fremdbild des Vereins"},{"$f":"IF($D$2>0,IF($C$5=\"-\",\"-\",'B_IV_H_H1_Öffentliche Darst'!H9),\"-\")","v":"-"},{"$f":"'B_IV_H_H2_Öffentlichkeits-PR'!B9","v":"E-Mail Informationen"},{"$f":"IF($D$2>0,IF($C$5=\"-\",\"-\",'B_IV_H_H2_Öffentlichkeits-PR'!H9),\"-\")","v":"-"},{"$f":"B_IV_H_H3_Kommunikation!B9","v":"Kommunikation_5"},{"$f":"IF($D$2>0,IF($C$5=\"-\",\"-\",B_IV_H_H3_Kommunikation!H9),\"-\")","v":"-"},{"$f":"'B_IV_H_H4_Veranstaltung-Events'!B9","v":"Musterevent_5"},{"$f":"IF($D$2>0,IF($C$5=\"-\",\"-\",'B_IV_H_H4_Veranstaltung-Events'!H9),\"-\")","v":"-"},{"$f":"'B_IV_H_H5_Benchmark Verm'!B9","v":"Zuschauerzahlen steigen"},{"$f":"IF($D$2>0,IF($C$5=\"-\",\"-\",'B_IV_H_H5_Benchmark Verm'!H9),\"-\")","v":"-"}]
[3,{"$f":"'B_IV_J Marketing Persp'!B4","v":"J. Marketingperspektive"},"-","-","-",{"$f":"IF(C7=\"-\",\"-\",\"100%\")","v":"-"},{"$f":"IF(C7=\"-\",\"-\",'B_IV_J Marketing Persp'!E2)","v":"-"},"-",0,null,null,{"$f":"'B_IV_H_H1_Öffentliche Darst'!B10","v":"Werte"},{"$f":"IF($D$2>0,IF($C$5=\"-\",\"-\",'B_IV_H_H1_Öffentliche Darst'!H10),\"-\")","v":"-"},{"$f":"'B_IV_H_H2_Öffentlichkeits-PR'!B10","v":"Printmedien"},{"$f":"IF($D$2>0,IF($C$5=\"-\",\"-\",'B_IV_H_H2_Öffentlichkeits-PR'!H10),\"-\")","v":"-"},{"$f":"B_IV_H_H3_Kommunikation!B10","v":"Kommunikation_6"},{"$f":"IF($D$2>0,IF($C$5=\"-\",\"-\",B_IV_H_H3_Kommunikation!H10),\"-\")","v":"-"},{"$f":"'B_IV_H_H4_Veranstaltung-Events'!B10","v":"Musterevent_6"},{"$f":"IF($D$2>0,IF($C$5=\"-\",\"-\",'B_IV_H_H4_Veranstaltung-Events'!H10),\"-\")","v":"-"},{"$f":"'B_IV_H_H5_Benchmark Verm'!B10","v":"Soziale Anerkennung steigt"},{"$f":"IF($D$2>0,IF($C$5=\"-\",\"-\",'B_IV_H_H5_Benchmark Verm'!H10),\"-\")","v":"-"}]
[4,null,null,null,null,null,null,{"$f":"IF(C8=1,G8,\"-\")","v":"-"},0,null,null,{"$f":"'B_IV_H_H1_Öffentliche Darst'!B11","v":"Vereinsgelände"},{"$f":"IF($D$2>0,IF($C$5=\"-\",\"-\",'B_IV_H_H1_Öffentliche Darst'!H11),\"-\")","v":"-"},{"$f":"'B_IV_H_H2_Öffentlichkeits-PR'!B11","v":"Regional TV"},{"$f":"IF($D$2>0,IF($C$5=\"-\",\"-\",'B_IV_H_H2_Öffentlichkeits-PR'!H11),\"-\")","v":"-"},{"$f":"B_IV_H_H3_Kommunikation!B11","v":"Kommunikation_7"},{"$f":"IF($D$2>0,IF($C$5=\"-\",\"-\",B_IV_H_H3_Kommunikation!H11),\"-\")","v":"-"},{"$f":"'B_IV_H_H4_Veranstaltung-Events'!B11","v":"Musterevent_7"},{"$f":"IF($D$2>0,IF($C$5=\"-\",\"-\",'B_IV_H_H4_Veranstaltung-Events'!H11),\"-\")","v":"-"},{"$f":"'B_IV_H_H5_Benchmark Verm'!B11","v":"Besserer Zugang zu (lokalen) Sponsoren"},{"$f":"IF($D$2>0,IF($C$5=\"-\",\"-\",'B_IV_H_H5_Benchmark Verm'!H11),\"-\")","v":"-"}]
[null,null,null,null,null,null,null,null,null,null,null,{"$f":"'B_IV_H_H1_Öffentliche Darst'!B12","v":"Denkhaltungen"},{"$f":"IF($D$2>0,IF($C$5=\"-\",\"-\",'B_IV_H_H1_Öffentliche Darst'!H12),\"-\")","v":"-"},{"$f":"'B_IV_H_H2_Öffentlichkeits-PR'!B12","v":"Platzsprecher"},{"$f":"IF($D$2>0,IF($C$5=\"-\",\"-\",'B_IV_H_H2_Öffentlichkeits-PR'!H12),\"-\")","v":"-"},{"$f":"B_IV_H_H3_Kommunikation!B12","v":"Kommunikation_8"},{"$f":"IF($D$2>0,IF($C$5=\"-\",\"-\",B_IV_H_H3_Kommunikation!H12),\"-\")","v":"-"},{"$f":"'B_IV_H_H4_Veranstaltung-Events'!B12","v":"Musterevent_8"},{"$f":"IF($D$2>0,IF($C$5=\"-\",\"-\",'B_IV_H_H4_Veranstaltung-Events'!H12),\"-\")","v":"-"},{"$f":"'B_IV_H_H5_Benchmark Verm'!B12","v":"Benchmark_8"},{"$f":"IF($D$2>0,IF($C$5=\"-\",\"-\",'B_IV_H_H5_Benchmark Verm'!H12),\"-\")","v":"-"}]
[null,null,null,null,null,null,null,null,null,null,null,{"$f":"'B_IV_H_H1_Öffentliche Darst'!B13","v":"Paradigmen"},{"$f":"IF($D$2>0,IF($C$5=\"-\",\"-\",'B_IV_H_H1_Öffentliche Darst'!H13),\"-\")","v":"-"},{"$f":"'B_IV_H_H2_Öffentlichkeits-PR'!B13","v":"Elternabende für NW Mannschaften"},{"$f":"IF($D$2>0,IF($C$5=\"-\",\"-\",'B_IV_H_H2_Öffentlichkeits-PR'!H13),\"-\")","v":"-"},{"$f":"B_IV_H_H3_Kommunikation!B13","v":"Kommunikation_9"},{"$f":"IF($D$2>0,IF($C$5=\"-\",\"-\",B_IV_H_H3_Kommunikation!H13),\"-\")","v":"-"},{"$f":"'B_IV_H_H4_Veranstaltung-Events'!B13","v":"Musterevent_9"},{"$f":"IF($D$2>0,IF($C$5=\"-\",\"-\",'B_IV_H_H4_Veranstaltung-Events'!H13),\"-\")","v":"-"},{"$f":"'B_IV_H_H5_Benchmark Verm'!B13","v":"Benchmark_9"},{"$f":"IF($D$2>0,IF($C$5=\"-\",\"-\",'B_IV_H_H5_Benchmark Verm'!H13),\"-\")","v":"-"}]
[]
[null,null,null,null,null,null,null,null,null,null,{"$f":"B6","v":"I. Kommunikationsperspektive"},{"$f":"'B_IV_I Kommunikations Persp'!$B$5","v":"I1. Kommunikationsablauf"},null,{"$f":"'B_IV_I_I2_Komm-Medien Heute'!$B$4","v":"I2. Kommunikation/Medien HEUTE"},null,{"$f":"'B_IV_I_I3_Die \"5W\" der Komm'!$B$4","v":"I3. Die \"5W\" der Kommunikation"},null,{"$f":"'B_IV_I_I4_Komm Innen-Außen'!$B$4","v":"I4. Kommunikation Innen/Außen"},null,{"$f":"'B_IV_I_I5_Komm Pressearbeit'!$B$4","v":"I5. Pressearbeit"}]
[null,null,null,null,null,null,null,null,null,null,null,{"$f":"B_IV_I_I1_Kommunikationsablauf!B5","v":"Kommunikationsablauf_1"},{"$f":"IF($D$2>0,IF($C$6=\"-\",\"-\",B_IV_I_I1_Kommunikationsablauf!H5),\"-\")","v":"-"},{"$f":"'B_IV_I_I2_Komm-Medien Heute'!B5","v":"Kommunikation Heute"},{"$f":"IF($D$2>0,IF($C$6=\"-\",\"-\",'B_IV_I_I2_Komm-Medien Heute'!H5),\"-\")","v":"-"},{"$f":"'B_IV_I_I3_Die \"5W\" der Komm'!B5","v":"Was möchte ich mit Kom. erreichen"},{"$f":"IF($D$2>0,IF($C$6=\"-\",\"-\",'B_IV_I_I3_Die \"5W\" der Komm'!H5),\"-\")","v":"-"},{"$f":"'B_IV_I_I4_Komm Innen-Außen'!B5","v":"Kommunikation nach Innen"},{"$f":"IF($D$2>0,IF($C$6=\"-\",\"-\",'B_IV_I_I4_Komm Innen-Außen'!H5),\"-\")","v":"-"},{"$f":"'B_IV_I_I5_Komm Pressearbeit'!B5","v":"Pressearbeit_1"},{"$f":"IF($D$2>0,IF($C$6=\"-\",\"-\",'B_IV_I_I5_Komm Pressearbeit'!H5),\"-\")","v":"-"}]
[null,null,null,null,null,null,null,null,null,null,null,{"$f":"B_IV_I_I1_Kommunikationsablauf!B6","v":"Kommunikationsablauf_2"},{"$f":"IF($D$2>0,IF($C$6=\"-\",\"-\",B_IV_I_I1_Kommunikationsablauf!H6),\"-\")","v":"-"},{"$f":"'B_IV_I_I2_Komm-Medien Heute'!B6","v":"Soziale Medien "},{"$f":"IF($D$2>0,IF($C$6=\"-\",\"-\",'B_IV_I_I2_Komm-Medien Heute'!H6),\"-\")","v":"-"},{"$f":"'B_IV_I_I3_Die \"5W\" der Komm'!B6","v":"Warum ist mir Kommunikation wichtig"},{"$f":"IF($D$2>0,IF($C$6=\"-\",\"-\",'B_IV_I_I3_Die \"5W\" der Komm'!H6),\"-\")","v":"-"},{"$f":"'B_IV_I_I4_Komm Innen-Außen'!B6","v":"Kommunikation nach Außen"},{"$f":"IF($D$2>0,IF($C$6=\"-\",\"-\",'B_IV_I_I4_Komm Innen-Außen'!H6),\"-\")","v":"-"},{"$f":"'B_IV_I_I5_Komm Pressearbeit'!B6","v":"Pressearbeit_2"},{"$f":"IF($D$2>0,IF($C$6=\"-\",\"-\",'B_IV_I_I5_Komm Pressearbeit'!H6),\"-\")","v":"-"}]
[null,null,null,null,null,null,null,null,null,null,null,{"$f":"B_IV_I_I1_Kommunikationsablauf!B7","v":"Kommunikationsablauf_3"},{"$f":"IF($D$2>0,IF($C$6=\"-\",\"-\",B_IV_I_I1_Kommunikationsablauf!H7),\"-\")","v":"-"},{"$f":"'B_IV_I_I2_Komm-Medien Heute'!B7","v":"Kommunikation Heute_3"},{"$f":"IF($D$2>0,IF($C$6=\"-\",\"-\",'B_IV_I_I2_Komm-Medien Heute'!H7),\"-\")","v":"-"},{"$f":"'B_IV_I_I3_Die \"5W\" der Komm'!B7","v":"Wen möchte ich erreichen"},{"$f":"IF($D$2>0,IF($C$6=\"-\",\"-\",'B_IV_I_I3_Die \"5W\" der Komm'!H7),\"-\")","v":"-"},{"$f":"'B_IV_I_I4_Komm Innen-Außen'!B7","v":"Kommunikation Innen/Außen_3"},{"$f":"IF($D$2>0,IF($C$6=\"-\",\"-\",'B_IV_I_I4_Komm Innen-Außen'!H7),\"-\")","v":"-"},{"$f":"'B_IV_I_I5_Komm Pressearbeit'!B7","v":"Pressearbeit_3"},{"$f":"IF($D$2>0,IF($C$6=\"-\",\"-\",'B_IV_I_I5_Komm Pressearbeit'!H7),\"-\")","v":"-"}]
[null,null,null,null,null,null,null,null,null,null,null,{"$f":"B_IV_I_I1_Kommunikationsablauf!B8","v":"Kommunikationsablauf_4"},{"$f":"IF($D$2>0,IF($C$6=\"-\",\"-\",B_IV_I_I1_Kommunikationsablauf!H8),\"-\")","v":"-"},{"$f":"'B_IV_I_I2_Komm-Medien Heute'!B8","v":"Kommunikation Heute_4"},{"$f":"IF($D$2>0,IF($C$6=\"-\",\"-\",'B_IV_I_I2_Komm-Medien Heute'!H8),\"-\")","v":"-"},{"$f":"'B_IV_I_I3_Die \"5W\" der Komm'!B8","v":"Wer ist meine Ziel-/Dialoggruppe"},{"$f":"IF($D$2>0,IF($C$6=\"-\",\"-\",'B_IV_I_I3_Die \"5W\" der Komm'!H8),\"-\")","v":"-"},{"$f":"'B_IV_I_I4_Komm Innen-Außen'!B8","v":"Kommunikation Innen/Außen_4"},{"$f":"IF($D$2>0,IF($C$6=\"-\",\"-\",'B_IV_I_I4_Komm Innen-Außen'!H8),\"-\")","v":"-"},{"$f":"'B_IV_I_I5_Komm Pressearbeit'!B8","v":"Pressearbeit_4"},{"$f":"IF($D$2>0,IF($C$6=\"-\",\"-\",'B_IV_I_I5_Komm Pressearbeit'!H8),\"-\")","v":"-"}]
[null,null,null,null,null,null,null,null,null,null,null,{"$f":"B_IV_I_I1_Kommunikationsablauf!B9","v":"Kommunikationsablauf_5"},{"$f":"IF($D$2>0,IF($C$6=\"-\",\"-\",B_IV_I_I1_Kommunikationsablauf!H9),\"-\")","v":"-"},{"$f":"'B_IV_I_I2_Komm-Medien Heute'!B9","v":"Kommunikation Heute_5"},{"$f":"IF($D$2>0,IF($C$6=\"-\",\"-\",'B_IV_I_I2_Komm-Medien Heute'!H9),\"-\")","v":"-"},{"$f":"'B_IV_I_I3_Die \"5W\" der Komm'!B9","v":"Was ist der Neuigkeitswert"},{"$f":"IF($D$2>0,IF($C$6=\"-\",\"-\",'B_IV_I_I3_Die \"5W\" der Komm'!H9),\"-\")","v":"-"},{"$f":"'B_IV_I_I4_Komm Innen-Außen'!B9","v":"Kommunikation Innen/Außen_5"},{"$f":"IF($D$2>0,IF($C$6=\"-\",\"-\",'B_IV_I_I4_Komm Innen-Außen'!H9),\"-\")","v":"-"},{"$f":"'B_IV_I_I5_Komm Pressearbeit'!B9","v":"Pressearbeit_5"},{"$f":"IF($D$2>0,IF($C$6=\"-\",\"-\",'B_IV_I_I5_Komm Pressearbeit'!H9),\"-\")","v":"-"}]
[null,null,null,null,null,null,null,null,null,null,null,{"$f":"B_IV_I_I1_Kommunikationsablauf!B10","v":"Kommunikationsablauf_6"},{"$f":"IF($D$2>0,IF($C$6=\"-\",\"-\",B_IV_I_I1_Kommunikationsablauf!H10),\"-\")","v":"-"},{"$f":"'B_IV_I_I2_Komm-Medien Heute'!B10","v":"Kommunikation Heute_6"},{"$f":"IF($D$2>0,IF($C$6=\"-\",\"-\",'B_IV_I_I2_Komm-Medien Heute'!H10),\"-\")","v":"-"},{"$f":"'B_IV_I_I3_Die \"5W\" der Komm'!B10","v":"Was ist anders, wenn wir gut kommunizieren"},{"$f":"IF($D$2>0,IF($C$6=\"-\",\"-\",'B_IV_I_I3_Die \"5W\" der Komm'!H10),\"-\")","v":"-"},{"$f":"'B_IV_I_I4_Komm Innen-Außen'!B10","v":"Kommunikation Innen/Außen_6"},{"$f":"IF($D$2>0,IF($C$6=\"-\",\"-\",'B_IV_I_I4_Komm Innen-Außen'!H10),\"-\")","v":"-"},{"$f":"'B_IV_I_I5_Komm Pressearbeit'!B10","v":"Pressearbeit_6"},{"$f":"IF($D$2>0,IF($C$6=\"-\",\"-\",'B_IV_I_I5_Komm Pressearbeit'!H10),\"-\")","v":"-"}]
[null,null,null,null,null,null,null,null,null,null,null,{"$f":"B_IV_I_I1_Kommunikationsablauf!B11","v":"Kommunikationsablauf_7"},{"$f":"IF($D$2>0,IF($C$6=\"-\",\"-\",B_IV_I_I1_Kommunikationsablauf!H11),\"-\")","v":"-"},{"$f":"'B_IV_I_I2_Komm-Medien Heute'!B11","v":"Kommunikation Heute_7"},{"$f":"IF($D$2>0,IF($C$6=\"-\",\"-\",'B_IV_I_I2_Komm-Medien Heute'!H11),\"-\")","v":"-"},{"$f":"'B_IV_I_I3_Die \"5W\" der Komm'!B11","v":"leer"},{"$f":"IF($D$2>0,IF($C$6=\"-\",\"-\",'B_IV_I_I3_Die \"5W\" der Komm'!H11),\"-\")","v":"-"},{"$f":"'B_IV_I_I4_Komm Innen-Außen'!B11","v":"Kommunikation Innen/Außen_7"},{"$f":"IF($D$2>0,IF($C$6=\"-\",\"-\",'B_IV_I_I4_Komm Innen-Außen'!H11),\"-\")","v":"-"},{"$f":"'B_IV_I_I5_Komm Pressearbeit'!B11","v":"Pressearbeit_7"},{"$f":"IF($D$2>0,IF($C$6=\"-\",\"-\",'B_IV_I_I5_Komm Pressearbeit'!H11),\"-\")","v":"-"}]
[null,null,null,null,null,null,null,null,null,null,null,{"$f":"B_IV_I_I1_Kommunikationsablauf!B12","v":"Kommunikationsablauf_8"},{"$f":"IF($D$2>0,IF($C$6=\"-\",\"-\",B_IV_I_I1_Kommunikationsablauf!H12),\"-\")","v":"-"},{"$f":"'B_IV_I_I2_Komm-Medien Heute'!B12","v":"Kommunikation Heute_8"},{"$f":"IF($D$2>0,IF($C$6=\"-\",\"-\",'B_IV_I_I2_Komm-Medien Heute'!H12),\"-\")","v":"-"},{"$f":"'B_IV_I_I3_Die \"5W\" der Komm'!B12","v":"leer"},{"$f":"IF($D$2>0,IF($C$6=\"-\",\"-\",'B_IV_I_I3_Die \"5W\" der Komm'!H12),\"-\")","v":"-"},{"$f":"'B_IV_I_I4_Komm Innen-Außen'!B12","v":"Kommunikation Innen/Außen_8"},{"$f":"IF($D$2>0,IF($C$6=\"-\",\"-\",'B_IV_I_I4_Komm Innen-Außen'!H12),\"-\")","v":"-"},{"$f":"'B_IV_I_I5_Komm Pressearbeit'!B12","v":"Pressearbeit_8"},{"$f":"IF($D$2>0,IF($C$6=\"-\",\"-\",'B_IV_I_I5_Komm Pressearbeit'!H12),\"-\")","v":"-"}]
[null,null,null,null,null,null,null,null,null,null,null,{"$f":"B_IV_I_I1_Kommunikationsablauf!B13","v":"Kommunikationsablauf_9"},{"$f":"IF($D$2>0,IF($C$6=\"-\",\"-\",B_IV_I_I1_Kommunikationsablauf!H13),\"-\")","v":"-"},{"$f":"'B_IV_I_I2_Komm-Medien Heute'!B13","v":"Kommunikation Heute_9"},{"$f":"IF($D$2>0,IF($C$6=\"-\",\"-\",'B_IV_I_I2_Komm-Medien Heute'!H13),\"-\")","v":"-"},{"$f":"'B_IV_I_I3_Die \"5W\" der Komm'!B13","v":"leer"},{"$f":"IF($D$2>0,IF($C$6=\"-\",\"-\",'B_IV_I_I3_Die \"5W\" der Komm'!H13),\"-\")","v":"-"},{"$f":"'B_IV_I_I4_Komm Innen-Außen'!B13","v":"Kommunikation Innen/Außen_9"},{"$f":"IF($D$2>0,IF($C$6=\"-\",\"-\",'B_IV_I_I4_Komm Innen-Außen'!H13),\"-\")","v":"-"},{"$f":"'B_IV_I_I5_Komm Pressearbeit'!B13","v":"Pressearbeit_9"},{"$f":"IF($D$2>0,IF($C$6=\"-\",\"-\",'B_IV_I_I5_Komm Pressearbeit'!H13),\"-\")","v":"-"}]
[]
[null,null,null,null,null,null,null,null,null,null,{"$f":"B7","v":"J. Marketingperspektive"},{"$f":"B_IV_J_J1_Marketingzyklus!$B$4","v":"J1. Marketingzyklus"},null,{"$f":"'B_IV_J_J2_Online-Content Market'!$B$4","v":"J2. Online/Content Marketing"},null,{"$f":"B_IV_J_J3_Sponsoring!$B$4","v":"J3. Sponsoring"},null,{"$f":"B_IV_J_J4_Sponsorenmappe!$B$4","v":"J4. Sponsorenmappe"}]
[null,null,null,null,null,null,null,null,null,null,null,{"$f":"B_IV_J_J1_Marketingzyklus!B5","v":"Wo steht der Verein"},{"$f":"IF($D$2>0,IF($C$7=\"-\",\"-\",B_IV_J_J1_Marketingzyklus!H5),\"-\")","v":"-"},{"$f":"'B_IV_J_J2_Online-Content Market'!B5","v":"Marketingabteilung vorhanden"},{"$f":"IF($D$2>0,IF($C$7=\"-\",\"-\",'B_IV_J_J2_Online-Content Market'!H5),\"-\")","v":"-"},{"$f":"B_IV_J_J3_Sponsoring!B5","v":"SOLL/IST Vergleich"},{"$f":"IF($D$2>0,IF($C$7=\"-\",\"-\",B_IV_J_J3_Sponsoring!H5),\"-\")","v":"-"},{"$f":"B_IV_J_J4_Sponsorenmappe!B5","v":"Sponsorenmappe bereits vorhanden"},{"$f":"IF($D$2>0,IF($C$7=\"-\",\"-\",B_IV_J_J4_Sponsorenmappe!H5),\"-\")","v":"-"}]
[null,null,null,null,null,null,null,null,null,null,null,{"$f":"B_IV_J_J1_Marketingzyklus!B6","v":"Wohin will der Verein"},{"$f":"IF($D$2>0,IF($C$7=\"-\",\"-\",B_IV_J_J1_Marketingzyklus!H6),\"-\")","v":"-"},{"$f":"'B_IV_J_J2_Online-Content Market'!B6","v":"Online Marketing Maßnahmen aktuell"},{"$f":"IF($D$2>0,IF($C$7=\"-\",\"-\",'B_IV_J_J2_Online-Content Market'!H6),\"-\")","v":"-"},{"$f":"B_IV_J_J3_Sponsoring!B6","v":"Infrastruktur"},{"$f":"IF($D$2>0,IF($C$7=\"-\",\"-\",B_IV_J_J3_Sponsoring!H6),\"-\")","v":"-"},{"$f":"B_IV_J_J4_Sponsorenmappe!B6","v":"Grundkonzept erstellt"},{"$f":"IF($D$2>0,IF($C$7=\"-\",\"-\",B_IV_J_J4_Sponsorenmappe!H6),\"-\")","v":"-"}]
[null,null,null,null,null,null,null,null,null,null,null,{"$f":"B_IV_J_J1_Marketingzyklus!B7","v":"Wie kommt man dort hin"},{"$f":"IF($D$2>0,IF($C$7=\"-\",\"-\",B_IV_J_J1_Marketingzyklus!H7),\"-\")","v":"-"},{"$f":"'B_IV_J_J2_Online-Content Market'!B7","v":"Online Marketing Ziele"},{"$f":"IF($D$2>0,IF($C$7=\"-\",\"-\",'B_IV_J_J2_Online-Content Market'!H7),\"-\")","v":"-"},{"$f":"B_IV_J_J3_Sponsoring!B7","v":"Verein allgemein"},{"$f":"IF($D$2>0,IF($C$7=\"-\",\"-\",B_IV_J_J3_Sponsoring!H7),\"-\")","v":"-"},{"$f":"B_IV_J_J4_Sponsorenmappe!B7","v":"Vereinspräsentation"},{"$f":"IF($D$2>0,IF($C$7=\"-\",\"-\",B_IV_J_J4_Sponsorenmappe!H7),\"-\")","v":"-"}]
[null,null,null,null,null,null,null,null,null,null,null,{"$f":"B_IV_J_J1_Marketingzyklus!B8","v":"Welche Mittel stehen zur Verfügung"},{"$f":"IF($D$2>0,IF($C$7=\"-\",\"-\",B_IV_J_J1_Marketingzyklus!H8),\"-\")","v":"-"},{"$f":"'B_IV_J_J2_Online-Content Market'!B8","v":"Vereins(Marken)-Bekanntheit"},{"$f":"IF($D$2>0,IF($C$7=\"-\",\"-\",'B_IV_J_J2_Online-Content Market'!H8),\"-\")","v":"-"},{"$f":"B_IV_J_J3_Sponsoring!B8","v":"Kleidung, Dressen, "},{"$f":"IF($D$2>0,IF($C$7=\"-\",\"-\",B_IV_J_J3_Sponsoring!H8),\"-\")","v":"-"},{"$f":"B_IV_J_J4_Sponsorenmappe!B8","v":"Erwachsenenfußball Sponsorkonzept"},{"$f":"IF($D$2>0,IF($C$7=\"-\",\"-\",B_IV_J_J4_Sponsorenmappe!H8),\"-\")","v":"-"}]
[null,null,null,null,null,null,null,null,null,null,null,{"$f":"B_IV_J_J1_Marketingzyklus!B9","v":"Wie sieht der Plan/Konzept aus"},{"$f":"IF($D$2>0,IF($C$7=\"-\",\"-\",B_IV_J_J1_Marketingzyklus!H9),\"-\")","v":"-"},{"$f":"'B_IV_J_J2_Online-Content Market'!B9","v":"Außendarstellung, Werte vermitteln"},{"$f":"IF($D$2>0,IF($C$7=\"-\",\"-\",'B_IV_J_J2_Online-Content Market'!H9),\"-\")","v":"-"},{"$f":"B_IV_J_J3_Sponsoring!B9","v":"Spiel"},{"$f":"IF($D$2>0,IF($C$7=\"-\",\"-\",B_IV_J_J3_Sponsoring!H9),\"-\")","v":"-"},{"$f":"B_IV_J_J4_Sponsorenmappe!B9","v":"Nachwuchsfußball Sponsorenkonzept"},{"$f":"IF($D$2>0,IF($C$7=\"-\",\"-\",B_IV_J_J4_Sponsorenmappe!H9),\"-\")","v":"-"}]
[null,null,null,null,null,null,null,null,null,null,null,{"$f":"B_IV_J_J1_Marketingzyklus!B10","v":"Umsetzung des Plans/Konzeptes"},{"$f":"IF($D$2>0,IF($C$7=\"-\",\"-\",B_IV_J_J1_Marketingzyklus!H10),\"-\")","v":"-"},{"$f":"'B_IV_J_J2_Online-Content Market'!B10","v":"CM-Zielgruppe definieren"},{"$f":"IF($D$2>0,IF($C$7=\"-\",\"-\",'B_IV_J_J2_Online-Content Market'!H10),\"-\")","v":"-"},{"$f":"B_IV_J_J3_Sponsoring!B10","v":"Heimspiel"},{"$f":"IF($D$2>0,IF($C$7=\"-\",\"-\",B_IV_J_J3_Sponsoring!H10),\"-\")","v":"-"},{"$f":"B_IV_J_J4_Sponsorenmappe!B10","v":"Sponsorvarianten, Visionen, Ziele"},{"$f":"IF($D$2>0,IF($C$7=\"-\",\"-\",B_IV_J_J4_Sponsorenmappe!H10),\"-\")","v":"-"}]
[null,null,null,null,null,null,null,null,null,null,null,{"$f":"B_IV_J_J1_Marketingzyklus!B11","v":"Kontrollen während der Umsetzung"},{"$f":"IF($D$2>0,IF($C$7=\"-\",\"-\",B_IV_J_J1_Marketingzyklus!H11),\"-\")","v":"-"},{"$f":"'B_IV_J_J2_Online-Content Market'!B11","v":"CM-Leistungesangebot definieren"},{"$f":"IF($D$2>0,IF($C$7=\"-\",\"-\",'B_IV_J_J2_Online-Content Market'!H11),\"-\")","v":"-"},{"$f":"B_IV_J_J3_Sponsoring!B11","v":"Werbedurchsagen"},{"$f":"IF($D$2>0,IF($C$7=\"-\",\"-\",B_IV_J_J3_Sponsoring!H11),\"-\")","v":"-"},{"$f":"B_IV_J_J4_Sponsorenmappe!B11","v":"Sponsorendatenliste vorhanden"},{"$f":"IF($D$2>0,IF($C$7=\"-\",\"-\",B_IV_J_J4_Sponsorenmappe!H11),\"-\")","v":"-"}]
[null,null,null,null,null,null,null,null,null,null,null,{"$f":"B_IV_J_J1_Marketingzyklus!B12","v":"Evaluierung am Ende des Zyklus"},{"$f":"IF($D$2>0,IF($C$7=\"-\",\"-\",B_IV_J_J1_Marketingzyklus!H12),\"-\")","v":"-"},{"$f":"'B_IV_J_J2_Online-Content Market'!B12","v":"CM- Evaluieren"},{"$f":"IF($D$2>0,IF($C$7=\"-\",\"-\",'B_IV_J_J2_Online-Content Market'!H12),\"-\")","v":"-"},{"$f":"B_IV_J_J3_Sponsoring!B12","v":"Fernsehen, Kantine"},{"$f":"IF($D$2>0,IF($C$7=\"-\",\"-\",B_IV_J_J3_Sponsoring!H12),\"-\")","v":"-"},{"$f":"B_IV_J_J4_Sponsorenmappe!B12","v":"Schriftliche Verträge"},{"$f":"IF($D$2>0,IF($C$7=\"-\",\"-\",B_IV_J_J4_Sponsorenmappe!H12),\"-\")","v":"-"}]
[null,null,null,null,null,null,null,null,null,null,null,{"$f":"B_IV_J_J1_Marketingzyklus!B13","v":"Ergebnisse als Basis des nächsten Zyklus"},{"$f":"IF($D$2>0,IF($C$7=\"-\",\"-\",B_IV_J_J1_Marketingzyklus!H13),\"-\")","v":"-"},{"$f":"'B_IV_J_J2_Online-Content Market'!B13","v":"CM-Zielgruppe u. Angebot erweitern"},{"$f":"IF($D$2>0,IF($C$7=\"-\",\"-\",'B_IV_J_J2_Online-Content Market'!H13),\"-\")","v":"-"},{"$f":"B_IV_J_J3_Sponsoring!B13","v":"Soziale Medien (Website, Zeitungen, ...)"},{"$f":"IF($D$2>0,IF($C$7=\"-\",\"-\",B_IV_J_J3_Sponsoring!H13),\"-\")","v":"-"},{"$f":"B_IV_J_J4_Sponsorenmappe!B13","v":"Jährliche Bepreisung in Zusatzblatt"},{"$f":"IF($D$2>0,IF($C$7=\"-\",\"-\",B_IV_J_J4_Sponsorenmappe!H13),\"-\")","v":"-"}]

{"sheet":"B_IV_H Öffentlichkeitsarb Persp","index":43,"n_rows":9,"n_cols":9,"rows_kept":9,"cut":false,"hidden":false,"merged":[[3,1,3,2],[3,5,3,6],[1,1,1,2],[2,1,2,2],[0,1,0,3],[0,4,0,6]]}
[null,"Strategy Map - Verein 4.0",null,null,{"$f":"B_Konzept!$E$1","v":"Union TTI St. Florian"}]
[null,"IV. Vermarktungskonzept",null,{"$f":"B_IV_Vermarktungs_Konzept!I5","v":0},{"$f":"IFERROR(E3/D2,0)","v":0},{"$f":"IFERROR(D2/G2,0)","v":0},{"$f":"COUNTIF($C$5:$C$9,1)","v":1}]
[null,"Vermarktungskonzepte",null,"Punkte",{"$f":"SUM(D5:D9)","v":0},"SOLL","IST"]
[null,"H. Öffentlichkeitsperspektive",null,"Konzept",null,"Die Ebenen"]
[1,{"$f":"'B_IV_H_H1_Öffentliche Darst'!B4","v":"H1. Öffentliche Darstellung"},"-",{"$f":"IF(C5=\"-\",\"-\",IFERROR(($D$2/COUNTIF($C$5:$C$9,\">0\")*(H5/F5)),\"-\"))","v":"-"},{"$f":"D5","v":"-"},{"$f":"IF(C5=\"-\",\"-\",\"100%\")","v":"-"},{"$f":"IF(C5=\"-\",\"-\",'B_IV_H_H1_Öffentliche Darst'!E2)","v":"-"},{"$f":"IF(C5=1,G5,\"-\")","v":"-"},{"$f":"IFERROR($F$2*C5,0)","v":0}]
[2,{"$f":"'B_IV_H_H2_Öffentlichkeits-PR'!B4","v":"H2. Medien/Öffentlichkeitsarbeit"},"-",{"$f":"IF(C6=\"-\",\"-\",IFERROR(($D$2/COUNTIF($C$5:$C$9,\">0\")*(H6/F6)),\"-\"))","v":"-"},{"$f":"D6","v":"-"},{"$f":"IF(C6=\"-\",\"-\",\"100%\")","v":"-"},{"$f":"IF(C6=\"-\",\"-\",'B_IV_H_H2_Öffentlichkeits-PR'!E2)","v":"-"},{"$f":"IF(C6=1,G6,\"-\")","v":"-"},{"$f":"IFERROR($F$2*C6,0)","v":0}]
[3,{"$f":"B_IV_H_H3_Kommunikation!B4","v":"H3. Kommunikation"},"-",{"$f":"IF(C7=\"-\",\"-\",IFERROR(($D$2/COUNTIF($C$5:$C$9,\">0\")*(H7/F7)),\"-\"))","v":"-"},"-",{"$f":"IF(C7=\"-\",\"-\",\"100%\")","v":"-"},{"$f":"IF(C7=\"-\",\"-\",B_IV_H_H3_Kommunikation!E2)","v":"-"},{"$f":"IF(C7=1,G7,\"-\")","v":"-"},0]
[4,{"$f":"'B_IV_H_H4_Veranstaltung-Events'!B4","v":"H4. Veranstaltungen-Events"},"-",{"$f":"IF(C8=\"-\",\"-\",IFERROR(($D$2/COUNTIF($C$5:$C$9,\">0\")*(H8/F8)),\"-\"))","v":"-"},{"$f":"D8","v":"-"},{"$f":"IF(C8=\"-\",\"-\",\"100%\")","v":"-"},{"$f":"IF(C8=\"-\",\"-\",'B_IV_H_H4_Veranstaltung-Events'!E2)","v":"-"},{"$f":"IF(C8=1,G8,\"-\")","v":"-"},0]
[5,{"$f":"'B_IV_H_H5_Benchmark Verm'!B4","v":"H5. Benchmark BVerm"},1,{"$f":"IF(C9=\"-\",\"-\",IFERROR(($D$2/COUNTIF($C$5:$C$9,\">0\")*(H9/F9)),\"-\"))","v":0},0,"100%",{"$f":"IF(C9=\"-\",\"-\",'B_IV_H_H5_Benchmark Verm'!E2)","v":0},{"$f":"IF(C9=1,G9,\"-\")","v":0},0]

{"sheet":"B_IV_H_H1_Öffentliche Darst","index":44,"n_rows":13,"n_cols":8,"rows_kept":13,"cut":false,"hidden":true,"merged":[[3,1,3,2],[3,5,3,6],[1,1,1,2],[2,1,2,2],[0,1,0,3],[0,4,0,6]]}
[null,"Strategy Map - Verein 4.0",null,null,{"$f":"B_Konzept!$E$1","v":"Union TTI St. Florian"}]
[null,"IV. Vermarktungskonzept",null,{"$f":"'B_IV_H Öffentlichkeitsarb Persp'!I5","v":0},{"$f":"IFERROR(E3/D2,0)","v":0},{"$f":"IFERROR(D2/G2,0)","v":0},{"$f":"COUNTIF($C$5:$C$13,1)","v":9}]
[null,"H. Öffentlichkeitsperspektive",null,"Punkte",{"$f":"SUM(D5:D13)","v":0},"SOLL","IST"]
[null,"H1. Öffentliche Darstellung",null,"Konzept",null,"Die Ebenen"]
[1,"Grundstrategie",1,{"$f":"IF(C5=\"-\",0,IFERROR(($D$2/COUNTIF($C$5:$C$13,\">0\")*(H5/F5)),0))","v":0},{"$f":"IF(C5=1,D5,\"-\")","v":0},1,0.98,{"$f":"IF($D$2=0,\"-\",IF(C5=1,G5,\"-\"))","v":"-"}]
[2,"Positionierung",1,0,{"$f":"IF(C6=1,D6,\"-\")","v":0},1,0.97,{"$f":"IF($D$2=0,\"-\",IF(C6=1,G6,\"-\"))","v":"-"}]
[3,"Darstellung nach Außen",1,{"$f":"IF(C7=\"-\",0,IFERROR(($D$2/COUNTIF($C$5:$C$13,\">0\")*(H7/F7)),0))","v":0},0,1,0.96,"-"]
[4,"Selbstbild des Vereins",1,{"$f":"IF(C8=\"-\",0,IFERROR(($D$2/COUNTIF($C$5:$C$13,\">0\")*(H8/F8)),0))","v":0},0,1,0.95,"-"]
[5,"Fremdbild des Vereins",1,0,0,1,0.94,"-"]
[6,"Werte",1,0,0,1,0.93,"-"]
[7,"Vereinsgelände",1,0,{"$f":"IF(C11=1,D11,\"-\")","v":0},1,0.92,"-"]
[8,"Denkhaltungen",1,0,{"$f":"IF(C12=1,D12,\"-\")","v":0},1,0.91,"-"]
[9,"Paradigmen",1,0,0,1,0.9,"-"]

{"sheet":"B_IV_H_H2_Öffentlichkeits-PR","index":45,"n_rows":13,"n_cols":8,"rows_kept":13,"cut":false,"hidden":true,"merged":[[3,1,3,2],[3,5,3,6],[1,1,1,2],[2,1,2,2],[0,1,0,3],[0,4,0,6]]}
[null,"Strategy Map - Verein 4.0",null,null,{"$f":"B_Konzept!$E$1","v":"Union TTI St. Florian"}]
[null,"IV. Vermarktungskonzept",null,{"$f":"'B_IV_H Öffentlichkeitsarb Persp'!I6","v":0},{"$f":"IFERROR(E3/D2,0)","v":0},{"$f":"IFERROR(D2/G2,0)","v":0},{"$f":"COUNTIF($C$5:$C$13,1)","v":9}]
[null,"H. Öffentlichkeitsperspektive",null,"Punkte",{"$f":"SUM(D5:D13)","v":0},"SOLL","IST"]
[null,"H2. Medien/Öffentlichkeitsarbeit",null,"Konzept",null,"Die Ebenen"]
[1,"Vereinswebsite",1,{"$f":"IF(C5=\"-\",0,IFERROR(($D$2/COUNTIF($C$5:$C$13,\">0\")*(H5/F5)),0))","v":0},{"$f":"IF(C5=1,D5,\"-\")","v":0},1,0.88,{"$f":"IF($D$2=0,\"-\",IF(C5=1,G5,\"-\"))","v":"-"}]
[2,"Verbandswebsite",1,0,{"$f":"IF(C6=1,D6,\"-\")","v":0},1,0.87,{"$f":"IF($D$2=0,\"-\",IF(C6=1,G6,\"-\"))","v":"-"}]
[3,"Soziale Medien",1,{"$f":"IF(C7=\"-\",0,IFERROR(($D$2/COUNTIF($C$5:$C$13,\">0\")*(H7/F7)),0))","v":0},0,1,0.86,"-"]
[4,"Spieltaginformation",1,{"$f":"IF(C8=\"-\",0,IFERROR(($D$2/COUNTIF($C$5:$C$13,\">0\")*(H8/F8)),0))","v":0},0,1,0.85,"-"]
[5,"E-Mail Informationen",1,0,0,1,0.84,"-"]
[6,"Printmedien",1,0,0,1,0.83,"-"]
[7,"Regional TV",1,0,{"$f":"IF(C11=1,D11,\"-\")","v":0},1,0.82,"-"]
[8,"Platzsprecher",1,0,{"$f":"IF(C12=1,D12,\"-\")","v":0},1,0.81,"-"]
[9,"Elternabende für NW Mannschaften",1,0,0,1,0.8,"-"]

{"sheet":"B_IV_H_H3_Kommunikation","index":46,"n_rows":13,"n_cols":8,"rows_kept":13,"cut":false,"hidden":true,"merged":[[3,1,3,2],[3,5,3,6],[1,1,1,2],[2,1,2,2],[0,1,0,3],[0,4,0,6]]}
[null,"Strategy Map - Verein 4.0",null,null,{"$f":"B_Konzept!$E$1","v":"Union TTI St. Florian"}]
[null,"IV. Vermarktungskonzept",null,{"$f":"'B_IV_H Öffentlichkeitsarb Persp'!I7","v":0},{"$f":"IFERROR(E3/D2,0)","v":0},{"$f":"IFERROR(D2/G2,0)","v":0},{"$f":"COUNTIF($C$5:$C$13,1)","v":9}]
[null,"H. Öffentlichkeitsperspektive",null,"Punkte",{"$f":"SUM(D5:D13)","v":0},"SOLL","IST"]
[null,"H3. Kommunikation",null,"Konzept",null,"Die Ebenen"]
[1,"Kommunikation_1",1,{"$f":"IF(C5=\"-\",0,IFERROR(($D$2/COUNTIF($C$5:$C$13,\">0\")*(H5/F5)),0))","v":0},{"$f":"IF(C5=1,D5,\"-\")","v":0},1,0.78,{"$f":"IF($D$2=0,\"-\",IF(C5=1,G5,\"-\"))","v":"-"}]
[2,"Kommunikation_2",1,0,{"$f":"IF(C6=1,D6,\"-\")","v":0},1,0.77,{"$f":"IF($D$2=0,\"-\",IF(C6=1,G6,\"-\"))","v":"-"}]
[3,"Kommunikation_3",1,{"$f":"IF(C7=\"-\",0,IFERROR(($D$2/COUNTIF($C$5:$C$13,\">0\")*(H7/F7)),0))","v":0},0,1,0.76,"-"]
[4,"Kommunikation_4",1,{"$f":"IF(C8=\"-\",0,IFERROR(($D$2/COUNTIF($C$5:$C$13,\">0\")*(H8/F8)),0))","v":0},0,1,0.75,"-"]
[5,"Kommunikation_5",1,0,0,1,0.74,"-"]
[6,"Kommunikation_6",1,0,0,1,0.73,"-"]
[7,"Kommunikation_7",1,0,{"$f":"IF(C11=1,D11,\"-\")","v":0},1,0.72,"-"]
[8,"Kommunikation_8",1,0,{"$f":"IF(C12=1,D12,\"-\")","v":0},1,0.71,"-"]
[9,"Kommunikation_9",1,0,0,1,0.7,"-"]

{"sheet":"B_IV_H_H4_Veranstaltung-Events","index":47,"n_rows":13,"n_cols":8,"rows_kept":13,"cut":false,"hidden":true,"merged":[[3,1,3,2],[3,5,3,6],[1,1,1,2],[2,1,2,2],[0,1,0,3],[0,4,0,6]]}
[null,"Strategy Map - Verein 4.0",null,null,{"$f":"B_Konzept!$E$1","v":"Union TTI St. Florian"}]
[null,"IV. Vermarktungskonzept",null,{"$f":"'B_IV_H Öffentlichkeitsarb Persp'!I8","v":0},{"$f":"IFERROR(E3/D2,0)","v":0},{"$f":"IFERROR(D2/G2,0)","v":0},{"$f":"COUNTIF($C$5:$C$13,1)","v":9}]
[null,"H. Öffentlichkeitsperspektive",null,"Punkte",{"$f":"SUM(D5:D13)","v":0},"SOLL","IST"]
[null,"H4. Veranstaltungen-Events",null,"Konzept",null,"Die Ebenen"]
[1,"Musterevent_1",1,{"$f":"IF(C5=\"-\",0,IFERROR(($D$2/COUNTIF($C$5:$C$13,\">0\")*(H5/F5)),0))","v":0},{"$f":"IF(C5=1,D5,\"-\")","v":0},1,0.68,{"$f":"IF($D$2=0,\"-\",IF(C5=1,G5,\"-\"))","v":"-"}]
[2,"Musterevent_2",1,0,{"$f":"IF(C6=1,D6,\"-\")","v":0},1,0.67,{"$f":"IF($D$2=0,\"-\",IF(C6=1,G6,\"-\"))","v":"-"}]
[3,"Musterevent_3",1,{"$f":"IF(C7=\"-\",0,IFERROR(($D$2/COUNTIF($C$5:$C$13,\">0\")*(H7/F7)),0))","v":0},0,1,0.66,"-"]
[4,"Musterevent_4",1,{"$f":"IF(C8=\"-\",0,IFERROR(($D$2/COUNTIF($C$5:$C$13,\">0\")*(H8/F8)),0))","v":0},0,1,0.65,"-"]
[5,"Musterevent_5",1,0,0,1,0.64,"-"]
[6,"Musterevent_6",1,0,0,1,0.63,"-"]
[7,"Musterevent_7",1,0,{"$f":"IF(C11=1,D11,\"-\")","v":0},1,0.62,"-"]
[8,"Musterevent_8",1,0,{"$f":"IF(C12=1,D12,\"-\")","v":0},1,0.61,"-"]
[9,"Musterevent_9",1,0,0,1,0.6,"-"]

{"sheet":"B_IV_H_H5_Benchmark Verm","index":48,"n_rows":13,"n_cols":8,"rows_kept":13,"cut":false,"hidden":false,"merged":[[3,1,3,2],[3,5,3,6],[1,1,1,2],[2,1,2,2],[0,1,0,3],[0,4,0,6]]}
[null,"Strategy Map - Verein 4.0",null,null,{"$f":"B_Konzept!$E$1","v":"Union TTI St. Florian"}]
[null,"IV. Vermarktungskonzept",null,{"$f":"'B_IV_H Öffentlichkeitsarb Persp'!I9","v":0},{"$f":"IFERROR(E3/D2,0)","v":0},{"$f":"IFERROR(D2/G2,0)","v":0},{"$f":"COUNTIF($C$5:$C$7,1)","v":3}]
[null,"H. Öffentlichkeitsperspektive",null,"Punkte",{"$f":"SUM(D5:D7)","v":0},"SOLL","IST"]
[null,"H5. Benchmark BVerm",null,"Konzept","Richtwerte","Die Ebenen"]
[1,"BMar1 - Mitgliederzahlen steigen",1,{"$f":"IF(C5=\"-\",0,IFERROR(($D$2/G2*(H5/F5)),0))","v":0},{"$f":"IF(C5=1,D5,\"-\")","v":0},1,0,{"$f":"IF($D$2=0,\"-\",IF(C5=1,G5,\"-\"))","v":"-"}]
[2,"BMar2 - Anteil Freiwilligenarbeit steigt",1,{"$f":"IF(C6=\"-\",0,IFERROR(($D$2/COUNTIF($C$5:$C$7,\">0\")*(H6/F6)),0))","v":0},{"$f":"IF(C6=1,D6,\"-\")","v":0},1,0,{"$f":"IF($D$2=0,\"-\",IF(C6=1,G6,\"-\"))","v":"-"}]
[3,"BMar3 - Ausschöpfung Marketingkanäle",1,{"$f":"IF(C7=\"-\",0,IFERROR(($D$2/COUNTIF($C$5:$C$7,\">0\")*(H7/F7)),0))","v":0},0,1,0,"-"]
[4,"Bessere Argumente für Subventionen","-",{"$f":"IF(C8=\"-\",0,IFERROR(($D$2/COUNTIF($C$5:$C$13,\">0\")*(H8/F8)),0))","v":0},"-",1,0,"-"]
[5,"Zuschauerzahlen steigen","-",0,"-",1,0,"-"]
[6,"Soziale Anerkennung steigt","-",0,"-",1,0,"-"]
[7,"Besserer Zugang zu (lokalen) Sponsoren","-",0,{"$f":"IF(C11=1,D11,\"-\")","v":"-"},1,0,"-"]
[8,"Benchmark_8","-",0,{"$f":"IF(C12=1,D12,\"-\")","v":"-"},1,0,"-"]
[9,"Benchmark_9","-",0,"-",1,0,"-"]

{"sheet":"B_IV_I Kommunikations Persp","index":49,"n_rows":9,"n_cols":9,"rows_kept":9,"cut":false,"hidden":true,"merged":[[1,1,1,2],[2,1,2,2],[3,1,3,2],[3,5,3,6],[0,1,0,3],[0,4,0,6]]}
[null,"Strategy Map - Verein 4.0",null,null,{"$f":"B_Konzept!E1","v":"Union TTI St. Florian"}]
[null,"IV. Vermarktungskonzept",null,{"$f":"B_IV_Vermarktungs_Konzept!I6","v":0},{"$f":"IFERROR(E3/D2,0)","v":0},{"$f":"IFERROR(D2/G2,0)","v":0},{"$f":"COUNTIF($C$5:$C$9,1)","v":5}]
[null,"Vermarktungskonzepte",null,"Punkte",{"$f":"SUM(D5:D9)","v":0},"SOLL","IST"]
[null,"I. Kommunikationsperspektive",null,"Konzept",null,"Die Ebenen"]
[1,{"$f":"B_IV_I_I1_Kommunikationsablauf!B4","v":"I1. Kommunikationsablauf"},1,{"$f":"IF(C5=\"-\",\"-\",IFERROR(($D$2/COUNTIF($C$5:$C$9,\">0\")*(H5/F5)),\"-\"))","v":0},{"$f":"D5","v":0},{"$f":"IF(C5=\"-\",\"-\",\"100%\")","v":"100%"},{"$f":"IF(C5=\"-\",\"-\",B_IV_I_I1_Kommunikationsablauf!E2)","v":0},{"$f":"IF(C5=1,G5,\"-\")","v":0},{"$f":"IFERROR($F$2*C5,0)","v":0}]
[2,{"$f":"'B_IV_I_I2_Komm-Medien Heute'!B4","v":"I2. Kommunikation/Medien HEUTE"},1,{"$f":"IF(C6=\"-\",\"-\",IFERROR(($D$2/COUNTIF($C$5:$C$9,\">0\")*(H6/F6)),\"-\"))","v":0},0,{"$f":"IF(C6=\"-\",\"-\",\"100%\")","v":"100%"},{"$f":"IF(C6=\"-\",\"-\",'B_IV_I_I2_Komm-Medien Heute'!E2)","v":0},{"$f":"IF(C6=1,G6,\"-\")","v":0},{"$f":"IFERROR($F$2*C6,0)","v":0}]
[3,{"$f":"'B_IV_I_I3_Die \"5W\" der Komm'!B4","v":"I3. Die \"5W\" der Kommunikation"},1,{"$f":"IF(C7=\"-\",\"-\",IFERROR(($D$2/COUNTIF($C$5:$C$9,\">0\")*(H7/F7)),\"-\"))","v":0},0,{"$f":"IF(C7=\"-\",\"-\",\"100%\")","v":"100%"},{"$f":"IF(C7=\"-\",\"-\",'B_IV_I_I3_Die \"5W\" der Komm'!E2)","v":0},{"$f":"IF(C7=1,G7,\"-\")","v":0},0]
[4,{"$f":"'B_IV_I_I4_Komm Innen-Außen'!B4","v":"I4. Kommunikation Innen/Außen"},1,0,0,{"$f":"IF(C8=\"-\",\"-\",\"100%\")","v":"100%"},{"$f":"IF(C8=\"-\",\"-\",'B_IV_I_I4_Komm Innen-Außen'!E2)","v":0},{"$f":"IF(C8=1,G8,\"-\")","v":0},0]
[5,{"$f":"'B_IV_I_I5_Komm Pressearbeit'!B4","v":"I5. Pressearbeit"},1,0,0,"100%",{"$f":"IF(C9=\"-\",\"-\",'B_IV_I_I5_Komm Pressearbeit'!E2)","v":0},{"$f":"IF(C9=1,G9,\"-\")","v":0},0]

{"sheet":"B_IV_I_I1_Kommunikationsablauf","index":50,"n_rows":13,"n_cols":8,"rows_kept":13,"cut":false,"hidden":true,"merged":[[1,1,1,2],[2,1,2,2],[3,5,3,6],[3,1,3,2],[0,1,0,3],[0,4,0,6]]}
[null,"Strategy Map - Verein 4.0",null,null,{"$f":"B_Konzept!E1","v":"Union TTI St. Florian"}]
[null,"IV. Vermarktungskonzept",null,{"$f":"'B_IV_I Kommunikations Persp'!I5","v":0},{"$f":"IFERROR(E3/D2,0)","v":0},{"$f":"IFERROR(D2/G2,0)","v":0},{"$f":"COUNTIF($C$5:$C$13,1)","v":9}]
[null,"I. Kommunikationsperspektive",null,"Punkte",{"$f":"SUM(D5:D13)","v":0},"SOLL","IST"]
[null,"I1. Kommunikationsablauf",null,"Konzept",null,"Die Ebenen"]
[1,"Kommunikationsablauf_1",1,{"$f":"IF(C5=\"-\",0,IFERROR(($D$2/COUNTIF($C$5:$C$13,\">0\")*(H5/F5)),0))","v":0},{"$f":"IF(C5=1,D5,\"-\")","v":0},1,0.98,{"$f":"IF($D$2=0,\"-\",IF(C5=1,G5,\"-\"))","v":"-"}]
[2,"Kommunikationsablauf_2",1,0,{"$f":"IF(C6=1,D6,\"-\")","v":0},1,0.97,{"$f":"IF($D$2=0,\"-\",IF(C6=1,G6,\"-\"))","v":"-"}]
[3,"Kommunikationsablauf_3",1,{"$f":"IF(C7=\"-\",0,IFERROR(($D$2/COUNTIF($C$5:$C$13,\">0\")*(H7/F7)),0))","v":0},0,1,0.96,"-"]
[4,"Kommunikationsablauf_4",1,{"$f":"IF(C8=\"-\",0,IFERROR(($D$2/COUNTIF($C$5:$C$13,\">0\")*(H8/F8)),0))","v":0},0,1,0.95,"-"]
[5,"Kommunikationsablauf_5",1,0,0,1,0.94,"-"]
[6,"Kommunikationsablauf_6",1,0,0,1,0.93,"-"]
[7,"Kommunikationsablauf_7",1,0,{"$f":"IF(C11=1,D11,\"-\")","v":0},1,0.92,"-"]
[8,"Kommunikationsablauf_8",1,0,{"$f":"IF(C12=1,D12,\"-\")","v":0},1,0.91,"-"]
[9,"Kommunikationsablauf_9",1,0,0,1,0.9,"-"]

{"sheet":"B_IV_I_I2_Komm-Medien Heute","index":51,"n_rows":13,"n_cols":8,"rows_kept":13,"cut":false,"hidden":true,"merged":[[1,1,1,2],[2,1,2,2],[3,5,3,6],[3,1,3,2],[0,1,0,3],[0,4,0,6]]}
[null,"Strategy Map - Verein 4.0",null,null,{"$f":"B_Konzept!E1","v":"Union TTI St. Florian"}]
[null,"IV. Vermarktungskonzept",null,{"$f":"'B_IV_I Kommunikations Persp'!I6","v":0},{"$f":"IFERROR(E3/D2,0)","v":0},{"$f":"IFERROR(D2/G2,0)","v":0},{"$f":"COUNTIF($C$5:$C$13,1)","v":9}]
[null,"I. Kommunikationsperspektive",null,"Punkte",{"$f":"SUM(D5:D13)","v":0},"SOLL","IST"]
[null,"I2. Kommunikation/Medien HEUTE",null,"Konzept",null,"Die Ebenen"]
[1,"Kommunikation Heute",1,{"$f":"IF(C5=\"-\",0,IFERROR(($D$2/COUNTIF($C$5:$C$13,\">0\")*(H5/F5)),0))","v":0},{"$f":"IF(C5=1,D5,\"-\")","v":0},1,0.88,{"$f":"IF($D$2=0,\"-\",IF(C5=1,G5,\"-\"))","v":"-"}]
[2,"Soziale Medien ",1,0,{"$f":"IF(C6=1,D6,\"-\")","v":0},1,0.869999999999999,{"$f":"IF($D$2=0,\"-\",IF(C6=1,G6,\"-\"))","v":"-"}]
[3,"Kommunikation Heute_3",1,{"$f":"IF(C7=\"-\",0,IFERROR(($D$2/COUNTIF($C$5:$C$13,\">0\")*(H7/F7)),0))","v":0},0,1,0.86,"-"]
[4,"Kommunikation Heute_4",1,{"$f":"IF(C8=\"-\",0,IFERROR(($D$2/COUNTIF($C$5:$C$13,\">0\")*(H8/F8)),0))","v":0},0,1,0.85,"-"]
[5,"Kommunikation Heute_5",1,0,0,1,0.84,"-"]
[6,"Kommunikation Heute_6",1,0,0,1,0.83,"-"]
[7,"Kommunikation Heute_7",1,0,{"$f":"IF(C11=1,D11,\"-\")","v":0},1,0.82,"-"]
[8,"Kommunikation Heute_8",1,0,{"$f":"IF(C12=1,D12,\"-\")","v":0},1,0.81,"-"]
[9,"Kommunikation Heute_9",1,0,0,1,0.8,"-"]

{"sheet":"B_IV_I_I3_Die \"5W\" der Komm","index":52,"n_rows":13,"n_cols":8,"rows_kept":13,"cut":false,"hidden":true,"merged":[[1,1,1,2],[2,1,2,2],[3,5,3,6],[3,1,3,2],[0,1,0,3],[0,4,0,6]]}
[null,"Strategy Map - Verein 4.0",null,null,{"$f":"B_Konzept!E1","v":"Union TTI St. Florian"}]
[null,"IV. Vermarktungskonzept",null,{"$f":"'B_IV_I Kommunikations Persp'!I7","v":0},{"$f":"IFERROR(E3/D2,0)","v":0},{"$f":"IFERROR(D2/G2,0)","v":0},{"$f":"COUNTIF($C$5:$C$13,1)","v":6}]
[null,"I. Kommunikationsperspektive",null,"Punkte",{"$f":"SUM(D5:D13)","v":0},"SOLL","IST"]
[null,"I3. Die \"5W\" der Kommunikation",null,"Konzept",null,"Die Ebenen"]
[1,"Was möchte ich mit Kom. erreichen",1,{"$f":"IF(C5=\"-\",0,IFERROR(($D$2/COUNTIF($C$5:$C$13,\">0\")*(H5/F5)),0))","v":0},{"$f":"IF(C5=1,D5,\"-\")","v":0},1,0.78,{"$f":"IF($D$2=0,\"-\",IF(C5=1,G5,\"-\"))","v":"-"}]
[2,"Warum ist mir Kommunikation wichtig",1,0,{"$f":"IF(C6=1,D6,\"-\")","v":0},1,0.77,{"$f":"IF($D$2=0,\"-\",IF(C6=1,G6,\"-\"))","v":"-"}]
[3,"Wen möchte ich erreichen",1,{"$f":"IF(C7=\"-\",0,IFERROR(($D$2/COUNTIF($C$5:$C$13,\">0\")*(H7/F7)),0))","v":0},0,1,0.76,"-"]
[4,"Wer ist meine Ziel-/Dialoggruppe",1,{"$f":"IF(C8=\"-\",0,IFERROR(($D$2/COUNTIF($C$5:$C$13,\">0\")*(H8/F8)),0))","v":0},0,1,0.75,"-"]
[5,"Was ist der Neuigkeitswert",1,0,0,1,0.74,"-"]
[6,"Was ist anders, wenn wir gut kommunizieren",1,0,0,1,0.73,"-"]
[7,"leer","-",0,{"$f":"IF(C11=1,D11,\"-\")","v":"-"},1,0,"-"]
[8,"leer","-",0,{"$f":"IF(C12=1,D12,\"-\")","v":"-"},1,0,"-"]
[9,"leer","-",0,"-",1,0,"-"]

{"sheet":"B_IV_I_I4_Komm Innen-Außen","index":53,"n_rows":13,"n_cols":8,"rows_kept":13,"cut":false,"hidden":true,"merged":[[1,1,1,2],[2,1,2,2],[3,5,3,6],[3,1,3,2],[0,1,0,3],[0,4,0,6]]}
[null,"Strategy Map - Verein 4.0",null,null,{"$f":"B_Konzept!E1","v":"Union TTI St. Florian"}]
[null,"IV. Vermarktungskonzept",null,{"$f":"'B_IV_I Kommunikations Persp'!I8","v":0},{"$f":"IFERROR(E3/D2,0)","v":0},{"$f":"IFERROR(D2/G2,0)","v":0},{"$f":"COUNTIF($C$5:$C$13,1)","v":9}]
[null,"I. Kommunikationsperspektive",null,"Punkte",{"$f":"SUM(D5:D13)","v":0},"SOLL","IST"]
[null,"I4. Kommunikation Innen/Außen",null,"Konzept",null,"Die Ebenen"]
[1,"Kommunikation nach Innen",1,{"$f":"IF(C5=\"-\",0,IFERROR(($D$2/COUNTIF($C$5:$C$13,\">0\")*(H5/F5)),0))","v":0},{"$f":"IF(C5=1,D5,\"-\")","v":0},1,0.68,{"$f":"IF($D$2=0,\"-\",IF(C5=1,G5,\"-\"))","v":"-"}]
[2,"Kommunikation nach Außen",1,0,{"$f":"IF(C6=1,D6,\"-\")","v":0},1,0.67,{"$f":"IF($D$2=0,\"-\",IF(C6=1,G6,\"-\"))","v":"-"}]
[3,"Kommunikation Innen/Außen_3",1,{"$f":"IF(C7=\"-\",0,IFERROR(($D$2/COUNTIF($C$5:$C$13,\">0\")*(H7/F7)),0))","v":0},0,1,0.66,"-"]
[4,"Kommunikation Innen/Außen_4",1,{"$f":"IF(C8=\"-\",0,IFERROR(($D$2/COUNTIF($C$5:$C$13,\">0\")*(H8/F8)),0))","v":0},0,1,0.65,"-"]
[5,"Kommunikation Innen/Außen_5",1,0,0,1,0.64,"-"]
[6,"Kommunikation Innen/Außen_6",1,0,0,1,0.63,"-"]
[7,"Kommunikation Innen/Außen_7",1,0,{"$f":"IF(C11=1,D11,\"-\")","v":0},1,0.62,"-"]
[8,"Kommunikation Innen/Außen_8",1,0,{"$f":"IF(C12=1,D12,\"-\")","v":0},1,0.61,"-"]
[9,"Kommunikation Innen/Außen_9",1,0,0,1,0.6,"-"]

{"sheet":"B_IV_I_I5_Komm Pressearbeit","index":54,"n_rows":13,"n_cols":8,"rows_kept":13,"cut":false,"hidden":true,"merged":[[1,1,1,2],[2,1,2,2],[3,5,3,6],[3,1,3,2],[0,1,0,3],[0,4,0,6]]}
[null,"Strategy Map - Verein 4.0",null,null,{"$f":"B_Konzept!E1","v":"Union TTI St. Florian"}]
[null,"IV. Vermarktungskonzept",null,{"$f":"'B_IV_I Kommunikations Persp'!I9","v":0},{"$f":"IFERROR(E3/D2,0)","v":0},{"$f":"IFERROR(D2/G2,0)","v":0},{"$f":"COUNTIF($C$5:$C$13,1)","v":9}]
[null,"I. Kommunikationsperspektive",null,"Punkte",{"$f":"SUM(D5:D13)","v":0},"SOLL","IST"]
[null,"I5. Pressearbeit",null,"Konzept",null,"Die Ebenen"]
[1,"Pressearbeit_1",1,{"$f":"IF(C5=\"-\",0,IFERROR(($D$2/COUNTIF($C$5:$C$13,\">0\")*(H5/F5)),0))","v":0},{"$f":"IF(C5=1,D5,\"-\")","v":0},1,0.57999999999999996,{"$f":"IF($D$2=0,\"-\",IF(C5=1,G5,\"-\"))","v":"-"}]
[2,"Pressearbeit_2",1,0,{"$f":"IF(C6=1,D6,\"-\")","v":0},1,0.56999999999999995,{"$f":"IF($D$2=0,\"-\",IF(C6=1,G6,\"-\"))","v":"-"}]
[3,"Pressearbeit_3",1,{"$f":"IF(C7=\"-\",0,IFERROR(($D$2/COUNTIF($C$5:$C$13,\">0\")*(H7/F7)),0))","v":0},0,1,0.56000000000000005,"-"]
[4,"Pressearbeit_4",1,{"$f":"IF(C8=\"-\",0,IFERROR(($D$2/COUNTIF($C$5:$C$13,\">0\")*(H8/F8)),0))","v":0},0,1,0.55000000000000004,"-"]
[5,"Pressearbeit_5",1,0,0,1,0.54,"-"]
[6,"Pressearbeit_6",1,0,0,1,0.53,"-"]
[7,"Pressearbeit_7",1,0,{"$f":"IF(C11=1,D11,\"-\")","v":0},1,0.52,"-"]
[8,"Pressearbeit_8",1,0,{"$f":"IF(C12=1,D12,\"-\")","v":0},1,0.51,"-"]
[9,"Pressearbeit_9",1,0,0,1,0.5,"-"]

{"sheet":"B_IV_J Marketing Persp","index":55,"n_rows":8,"n_cols":9,"rows_kept":8,"cut":false,"hidden":true,"merged":[[1,1,1,2],[2,1,2,2],[3,1,3,2],[0,1,0,3],[0,4,0,6],[3,5,3,6]]}
[null,"Strategy Map - Verein 4.0",null,null,{"$f":"B_Konzept!$E$1","v":"Union TTI St. Florian"}]
[null,"IV. Vermarktungskonzept",null,{"$f":"B_IV_Vermarktungs_Konzept!I7","v":0},{"$f":"IFERROR(E3/D2,0)","v":0},{"$f":"IFERROR(D2/G2,0)","v":0},{"$f":"COUNTIF($C$5:$C$8,1)","v":4}]
[null,"Vermarktungskonzepte",null,"Punkte",{"$f":"SUM(D5:D8)","v":0},"SOLL","IST"]
[null,"J. Marketingperspektive",null,"Konzept",null,"Die Ebenen"]
[1,{"$f":"B_IV_J_J1_Marketingzyklus!B4","v":"J1. Marketingzyklus"},1,{"$f":"IF(C5=\"-\",\"-\",IFERROR(($D$2/COUNTIF($C$5:$C$9,\">0\")*(H5/F5)),\"-\"))","v":0},{"$f":"D5","v":0},{"$f":"IF(C5=\"-\",\"-\",\"100%\")","v":"100%"},{"$f":"IF(C5=\"-\",\"-\",B_IV_J_J1_Marketingzyklus!E2)","v":0},{"$f":"IF(C5=1,G5,\"-\")","v":0},{"$f":"IFERROR($F$2*C5,0)","v":0}]
[2,{"$f":"'B_IV_J_J2_Online-Content Market'!B4","v":"J2. Online/Content Marketing"},1,{"$f":"IF(C6=\"-\",\"-\",IFERROR(($D$2/COUNTIF($C$5:$C$9,\">0\")*(H6/F6)),\"-\"))","v":0},0,{"$f":"IF(C6=\"-\",\"-\",\"100%\")","v":"100%"},{"$f":"IF(C6=\"-\",\"-\",'B_IV_J_J2_Online-Content Market'!E2)","v":0},{"$f":"IF(C6=1,G6,\"-\")","v":0},{"$f":"IFERROR($F$2*C6,0)","v":0}]
[3,{"$f":"B_IV_J_J3_Sponsoring!B4","v":"J3. Sponsoring"},1,{"$f":"IF(C7=\"-\",\"-\",IFERROR(($D$2/COUNTIF($C$5:$C$9,\">0\")*(H7/F7)),\"-\"))","v":0},0,{"$f":"IF(C7=\"-\",\"-\",\"100%\")","v":"100%"},{"$f":"IF(C7=\"-\",\"-\",B_IV_J_J3_Sponsoring!E2)","v":0},0,0]
[4,{"$f":"B_IV_J_J4_Sponsorenmappe!B4","v":"J4. Sponsorenmappe"},1,0,0,{"$f":"IF(C8=\"-\",\"-\",\"100%\")","v":"100%"},{"$f":"IF(C8=\"-\",\"-\",B_IV_J_J4_Sponsorenmappe!E2)","v":0},0,0]

{"sheet":"B_IV_J_J1_Marketingzyklus","index":56,"n_rows":13,"n_cols":8,"rows_kept":13,"cut":false,"hidden":true,"merged":[[1,1,1,2],[2,1,2,2],[3,1,3,2],[0,1,0,3],[0,4,0,6],[3,5,3,6]]}
[null,"Strategy Map - Verein 4.0",null,null,{"$f":"B_Konzept!$E$1","v":"Union TTI St. Florian"}]
[null,"IV. Vermarktungskonzept",null,{"$f":"'B_IV_J Marketing Persp'!I5","v":0},{"$f":"IFERROR(E3/D2,0)","v":0},{"$f":"IFERROR(D2/G2,0)","v":0},{"$f":"COUNTIF($C$5:$C$13,1)","v":9}]
[null,"J. Marketingperspektive",null,"Punkte",{"$f":"SUM(D5:D13)","v":0},"SOLL","IST"]
[null,"J1. Marketingzyklus",null,"Konzept",null,"Die Ebenen"]
[1,"Wo steht der Verein",1,{"$f":"IF(C5=\"-\",0,IFERROR(($D$2/COUNTIF($C$5:$C$13,\">0\")*(H5/F5)),0))","v":0},{"$f":"IF(C5=1,D5,\"-\")","v":0},1,0.88,{"$f":"IF($D$2=0,\"-\",IF(C5=1,G5,\"-\"))","v":"-"}]
[2,"Wohin will der Verein",1,0,{"$f":"IF(C6=1,D6,\"-\")","v":0},1,0.869999999999999,{"$f":"IF($D$2=0,\"-\",IF(C6=1,G6,\"-\"))","v":"-"}]
[3,"Wie kommt man dort hin",1,{"$f":"IF(C7=\"-\",0,IFERROR(($D$2/COUNTIF($C$5:$C$13,\">0\")*(H7/F7)),0))","v":0},0,1,0.86,"-"]
[4,"Welche Mittel stehen zur Verfügung",1,{"$f":"IF(C8=\"-\",0,IFERROR(($D$2/COUNTIF($C$5:$C$13,\">0\")*(H8/F8)),0))","v":0},0,1,0.85,"-"]
[5,"Wie sieht der Plan/Konzept aus",1,0,0,1,0.84,"-"]
[6,"Umsetzung des Plans/Konzeptes",1,0,0,1,0.83,"-"]
[7,"Kontrollen während der Umsetzung",1,0,{"$f":"IF(C11=1,D11,\"-\")","v":0},1,0.82,"-"]
[8,"Evaluierung am Ende des Zyklus",1,0,{"$f":"IF(C12=1,D12,\"-\")","v":0},1,0.81,"-"]
[9,"Ergebnisse als Basis des nächsten Zyklus",1,0,0,1,0.8,"-"]

{"sheet":"B_IV_J_J2_Online-Content Market","index":57,"n_rows":13,"n_cols":8,"rows_kept":13,"cut":false,"hidden":true,"merged":[[1,1,1,2],[2,1,2,2],[3,1,3,2],[0,1,0,3],[0,4,0,6],[3,5,3,6]]}
[null,"Strategy Map - Verein 4.0",null,null,{"$f":"B_Konzept!$E$1","v":"Union TTI St. Florian"}]
[null,"IV. Vermarktungskonzept",null,{"$f":"'B_IV_J Marketing Persp'!I6","v":0},{"$f":"IFERROR(E3/D2,0)","v":0},{"$f":"IFERROR(D2/G2,0)","v":0},{"$f":"COUNTIF($C$5:$C$13,1)","v":9}]
[null,"J. Marketingperspektive",null,"Punkte",{"$f":"SUM(D5:D13)","v":0},"SOLL","IST"]
[null,"J2. Online/Content Marketing",null,"Konzept",null,"Die Ebenen"]
[1,"Marketingabteilung vorhanden",1,{"$f":"IF(C5=\"-\",0,IFERROR(($D$2/COUNTIF($C$5:$C$13,\">0\")*(H5/F5)),0))","v":0},{"$f":"IF(C5=1,D5,\"-\")","v":0},1,0.78,{"$f":"IF($D$2=0,\"-\",IF(C5=1,G5,\"-\"))","v":"-"}]
[2,"Online Marketing Maßnahmen aktuell",1,0,{"$f":"IF(C6=1,D6,\"-\")","v":0},1,0.77,{"$f":"IF($D$2=0,\"-\",IF(C6=1,G6,\"-\"))","v":"-"}]
[3,"Online Marketing Ziele",1,{"$f":"IF(C7=\"-\",0,IFERROR(($D$2/COUNTIF($C$5:$C$13,\">0\")*(H7/F7)),0))","v":0},0,1,0.76,"-"]
[4,"Vereins(Marken)-Bekanntheit",1,{"$f":"IF(C8=\"-\",0,IFERROR(($D$2/COUNTIF($C$5:$C$13,\">0\")*(H8/F8)),0))","v":0},0,1,0.75,"-"]
[5,"Außendarstellung, Werte vermitteln",1,0,0,1,0.74,"-"]
[6,"CM-Zielgruppe definieren",1,0,0,1,0.73,"-"]
[7,"CM-Leistungesangebot definieren",1,0,{"$f":"IF(C11=1,D11,\"-\")","v":0},1,0.72,"-"]
[8,"CM- Evaluieren",1,0,{"$f":"IF(C12=1,D12,\"-\")","v":0},1,0.71,"-"]
[9,"CM-Zielgruppe u. Angebot erweitern",1,0,0,1,0.7,"-"]

{"sheet":"B_IV_J_J3_Sponsoring","index":58,"n_rows":13,"n_cols":8,"rows_kept":13,"cut":false,"hidden":true,"merged":[[1,1,1,2],[2,1,2,2],[3,1,3,2],[0,1,0,3],[0,4,0,6],[3,5,3,6]]}
[null,"Strategy Map - Verein 4.0",null,null,{"$f":"B_Konzept!$E$1","v":"Union TTI St. Florian"}]
[null,"IV. Vermarktungskonzept",null,{"$f":"'B_IV_J Marketing Persp'!I7","v":0},{"$f":"IFERROR(E3/D2,0)","v":0},{"$f":"IFERROR(D2/G2,0)","v":0},{"$f":"COUNTIF($C$5:$C$13,1)","v":9}]
[null,"J. Marketingperspektive",null,"Punkte",{"$f":"SUM(D5:D13)","v":0},"SOLL","IST"]
[null,"J3. Sponsoring",null,"Konzept",null,"Die Ebenen"]
[1,"SOLL/IST Vergleich",1,{"$f":"IF(C5=\"-\",0,IFERROR(($D$2/COUNTIF($C$5:$C$13,\">0\")*(H5/F5)),0))","v":0},{"$f":"IF(C5=1,D5,\"-\")","v":0},1,0.68,{"$f":"IF($D$2=0,\"-\",IF(C5=1,G5,\"-\"))","v":"-"}]
[2,"Infrastruktur",1,0,{"$f":"IF(C6=1,D6,\"-\")","v":0},1,0.67,{"$f":"IF($D$2=0,\"-\",IF(C6=1,G6,\"-\"))","v":"-"}]
[3,"Verein allgemein",1,{"$f":"IF(C7=\"-\",0,IFERROR(($D$2/COUNTIF($C$5:$C$13,\">0\")*(H7/F7)),0))","v":0},0,1,0.66,"-"]
[4,"Kleidung, Dressen, ",1,{"$f":"IF(C8=\"-\",0,IFERROR(($D$2/COUNTIF($C$5:$C$13,\">0\")*(H8/F8)),0))","v":0},0,1,0.65,"-"]
[5,"Spiel",1,0,0,1,0.64,"-"]
[6,"Heimspiel",1,0,0,1,0.63,"-"]
[7,"Werbedurchsagen",1,0,{"$f":"IF(C11=1,D11,\"-\")","v":0},1,0.62,"-"]
[8,"Fernsehen, Kantine",1,0,{"$f":"IF(C12=1,D12,\"-\")","v":0},1,0.61,"-"]
[9,"Soziale Medien (Website, Zeitungen, ...)",1,0,0,1,0.6,"-"]

{"sheet":"B_IV_J_J4_Sponsorenmappe","index":59,"n_rows":13,"n_cols":8,"rows_kept":13,"cut":false,"hidden":true,"merged":[[1,1,1,2],[2,1,2,2],[3,1,3,2],[0,1,0,3],[0,4,0,6],[3,5,3,6]]}
[null,"Strategy Map - Verein 4.0",null,null,{"$f":"B_Konzept!$E$1","v":"Union TTI St. Florian"}]
[null,"IV. Vermarktungskonzept",null,{"$f":"'B_IV_J Marketing Persp'!I8","v":0},{"$f":"IFERROR(E3/D2,0)","v":0},{"$f":"IFERROR(D2/G2,0)","v":0},{"$f":"COUNTIF($C$5:$C$13,1)","v":9}]
[null,"J. Marketingperspektive",null,"Punkte",{"$f":"SUM(D5:D13)","v":0},"SOLL","IST"]
[null,"J4. Sponsorenmappe",null,"Konzept",null,"Die Ebenen"]
[1,"Sponsorenmappe bereits vorhanden",1,{"$f":"IF(C5=\"-\",0,IFERROR(($D$2/COUNTIF($C$5:$C$13,\">0\")*(H5/F5)),0))","v":0},{"$f":"IF(C5=1,D5,\"-\")","v":0},1,0.57999999999999996,{"$f":"IF($D$2=0,\"-\",IF(C5=1,G5,\"-\"))","v":"-"}]
[2,"Grundkonzept erstellt",1,0,{"$f":"IF(C6=1,D6,\"-\")","v":0},1,0.56999999999999995,{"$f":"IF($D$2=0,\"-\",IF(C6=1,G6,\"-\"))","v":"-"}]
[3,"Vereinspräsentation",1,{"$f":"IF(C7=\"-\",0,IFERROR(($D$2/COUNTIF($C$5:$C$13,\">0\")*(H7/F7)),0))","v":0},0,1,0.56000000000000005,"-"]
[4,"Erwachsenenfußball Sponsorkonzept",1,{"$f":"IF(C8=\"-\",0,IFERROR(($D$2/COUNTIF($C$5:$C$13,\">0\")*(H8/F8)),0))","v":0},0,1,0.55000000000000004,"-"]
[5,"Nachwuchsfußball Sponsorenkonzept",1,0,0,1,0.54,"-"]
[6,"Sponsorvarianten, Visionen, Ziele",1,0,0,1,0.53,"-"]
[7,"Sponsorendatenliste vorhanden",1,0,{"$f":"IF(C11=1,D11,\"-\")","v":0},1,0.52,"-"]
[8,"Schriftliche Verträge",1,0,{"$f":"IF(C12=1,D12,\"-\")","v":0},1,0.51,"-"]
[9,"Jährliche Bepreisung in Zusatzblatt",1,0,0,1,0.5,"-"]

{"sheet":"B_V_Nachhaltigkeits_Konzept","index":60,"n_rows":11,"n_cols":13,"rows_kept":11,"cut":false,"hidden":true,"merged":[[10,4,23,6],[0,1,0,3],[0,4,0,6],[1,1,1,2],[2,1,2,2],[3,1,3,2],[3,5,3,6]]}
[null,"Strategy Map - Verein 4.0",null,null,{"$f":"B_Konzept!$E$1","v":"Union TTI St. Florian"},null,null,null,null,null,{"$f":"$B$5","v":"N. Nachhaltigkeitsperspektive"},{"$f":"B_V_N_N1_Nachhaltigkeit!B4","v":"N1. Nachhaltigkeit"}]
[null,"V. Nachhaltigkeitskonzept",null,{"$f":"B_Konzept!I9","v":0},{"$f":"IFERROR(E3/D2,0)","v":0},{"$f":"IFERROR(D2/G2,0)","v":0},{"$f":"COUNTIF($C$5:$C$8,1)","v":1},null,null,null,null,{"$f":"B_V_N_N1_Nachhaltigkeit!B5","v":"Strom - Test für Strategy Map"},{"$f":"IF($D$2>0,IF($C$5=\"-\",\"-\",B_V_N_N1_Nachhaltigkeit!H5),\"-\")","v":"-"}]
[null,"Nachhaltigkeitskonzept",null,"Punkte",{"$f":"SUM(D5:D8)","v":0},"SOLL","IST",null,null,null,null,{"$f":"B_V_N_N1_Nachhaltigkeit!B6","v":"Wasser"},{"$f":"IF($D$2>0,IF($C$5=\"-\",\"-\",B_V_N_N1_Nachhaltigkeit!H6),\"-\")","v":"-"}]
[null,null,null,"Konzept",null,"Die Ebenen",null,null,null,null,null,{"$f":"B_V_N_N1_Nachhaltigkeit!B7","v":"Gastronomie"},{"$f":"IF($D$2>0,IF($C$5=\"-\",\"-\",B_V_N_N1_Nachhaltigkeit!H7),\"-\")","v":"-"}]
[1,{"$f":"B_V_N_Nachhaltigkeitspersp!B4","v":"N. Nachhaltigkeitsperspektive"},1,{"$f":"IF(C5=\"-\",\"-\",IFERROR(($D$2/COUNTIF($C$5:$C$8,\">0\")*(H5/F5)),\"-\"))","v":0},{"$f":"D5","v":0},{"$f":"IF(C5=\"-\",\"-\",\"100%\")","v":"100%"},{"$f":"IF(C5=\"-\",\"-\",B_V_N_Nachhaltigkeitspersp!E2)","v":0},{"$f":"IF(C5=1,G5,\"-\")","v":0},{"$f":"IFERROR($F$2*C5,0)","v":0},null,null,{"$f":"B_V_N_N1_Nachhaltigkeit!B8","v":"Rasen"},{"$f":"IF($D$2>0,IF($C$5=\"-\",\"-\",B_V_N_N1_Nachhaltigkeit!H8),\"-\")","v":"-"}]
[2,null,"-",{"$f":"IF(C6=\"-\",\"-\",IFERROR(($D$2/COUNTIF($C$5:$C$7,\">0\")*(H6/F6)),\"-\"))","v":"-"},{"$f":"D6","v":"-"},{"$f":"IF(C6=\"-\",\"-\",\"100%\")","v":"-"},"-",{"$f":"IF(C6=1,G6,\"-\")","v":"-"},{"$f":"IFERROR($F$2*C6,0)","v":0},null,null,{"$f":"B_V_N_N1_Nachhaltigkeit!B9","v":"Vereinsgelände"},{"$f":"IF($D$2>0,IF($C$5=\"-\",\"-\",B_V_N_N1_Nachhaltigkeit!H9),\"-\")","v":"-"}]
[3,null,"-",{"$f":"IF(C7=\"-\",\"-\",IFERROR(($D$2/COUNTIF($C$5:$C$7,\">0\")*(H7/F7)),\"-\"))","v":"-"},"-",{"$f":"IF(C7=\"-\",\"-\",\"100%\")","v":"-"},"-","-",0,null,null,{"$f":"B_V_N_N1_Nachhaltigkeit!B10","v":"Veranstaltungen"},{"$f":"IF($D$2>0,IF($C$5=\"-\",\"-\",B_V_N_N1_Nachhaltigkeit!H10),\"-\")","v":"-"}]
[4,null,"-","-","-","-","-","-",0,null,null,{"$f":"B_V_N_N1_Nachhaltigkeit!B11","v":"Gebäude"},{"$f":"IF($D$2>0,IF($C$5=\"-\",\"-\",B_V_N_N1_Nachhaltigkeit!H11),\"-\")","v":"-"}]
[null,null,null,null,null,null,null,null,null,null,null,{"$f":"B_V_N_N1_Nachhaltigkeit!B12","v":"Verwaltung"},{"$f":"IF($D$2>0,IF($C$5=\"-\",\"-\",B_V_N_N1_Nachhaltigkeit!H12),\"-\")","v":"-"}]
[null,null,null,null,null,null,null,null,null,null,null,{"$f":"B_V_N_N1_Nachhaltigkeit!B13","v":"Test"},{"$f":"IF($D$2>0,IF($C$5=\"-\",\"-\",B_V_N_N1_Nachhaltigkeit!H13),\"-\")","v":"-"}]
[null,null,null,null,"Diese Datei ist nicht freigegeben\nNur eine Demo-Version!"]

{"sheet":"B_V_N_Nachhaltigkeitspersp","index":61,"n_rows":11,"n_cols":8,"rows_kept":11,"cut":false,"hidden":true,"merged":[[10,4,23,6],[0,1,0,3],[0,4,0,6],[1,1,1,2],[2,1,2,2],[3,1,3,2],[3,5,3,6]]}
[null,"Strategy Map - Verein 4.0",null,null,{"$f":"B_Konzept!$E$1","v":"Union TTI St. Florian"}]
[null,"V. Nachhaltigkeits Konzept",null,{"$f":"B_V_Nachhaltigkeits_Konzept!I5","v":0},{"$f":"IFERROR(E3/D2,0)","v":0},{"$f":"IFERROR(D2/G2,0)","v":0},{"$f":"COUNTIF($C$5:$C$8,1)","v":1}]
[null,"Nachhaltigkeitskonzept",null,"Punkte",{"$f":"SUM(D5:D8)","v":0},"SOLL","IST"]
[null,"N. Nachhaltigkeitsperspektive",null,"Konzept",null,"Die Ebenen"]
[1,{"$f":"B_V_N_N1_Nachhaltigkeit!B4","v":"N1. Nachhaltigkeit"},1,{"$f":"IF(C5=\"-\",\"-\",IFERROR(($D$2/COUNTIF($C$5:$C$8,\">0\")*(H5/F5)),\"-\"))","v":0},{"$f":"D5","v":0},{"$f":"IF(C5=\"-\",\"-\",\"100%\")","v":"100%"},{"$f":"IF(C5=1,B_V_N_N1_Nachhaltigkeit!E2,\"-\")","v":0},{"$f":"IF(C5=1,G5,\"-\")","v":0}]
[2,null,"-",{"$f":"IF(C6=\"-\",\"-\",IFERROR(($D$2/COUNTIF($C$5:$C$8,\">0\")*(H6/F6)),\"-\"))","v":"-"},{"$f":"D6","v":"-"},{"$f":"IF(C6=\"-\",\"-\",\"100%\")","v":"-"},"-",{"$f":"IF(C6=1,G6,\"-\")","v":"-"}]
[3,null,"-",{"$f":"IF(C7=\"-\",\"-\",IFERROR(($D$2/COUNTIF($C$5:$C$8,\">0\")*(H7/F7)),\"-\"))","v":"-"},"-","-","-","-"]
[4,null,"-",{"$f":"IF(C8=\"-\",\"-\",IFERROR(($D$2/COUNTIF($C$5:$C$8,\">0\")*(H8/F8)),\"-\"))","v":"-"},"-","-","-","-"]
[]
[]
[null,null,null,null,"Diese Datei ist nicht freigegeben\nNur eine Demo-Version!"]

{"sheet":"B_V_N_N1_Nachhaltigkeit","index":62,"n_rows":13,"n_cols":8,"rows_kept":13,"cut":false,"hidden":true,"merged":[[0,1,0,3],[0,4,0,6],[1,1,1,2],[2,1,2,2],[3,1,3,2],[3,5,3,6]]}
[null,"Strategy Map - Verein 4.0",null,null,{"$f":"B_Konzept!$E$1","v":"Union TTI St. Florian"}]
[null,"V. Nachhaltigkeits Konzept",null,{"$f":"B_V_N_Nachhaltigkeitspersp!F2","v":0},{"$f":"IFERROR(E3/D2,0)","v":0},{"$f":"IFERROR(D2/G2,0)","v":0},{"$f":"COUNTIF($C$5:$C$13,1)","v":1}]
[null,"N. Nachhaltigkeitsperspektive",null,"Punkte",{"$f":"SUM(D5:D13)","v":0},"SOLL","IST"]
[null,"N1. Nachhaltigkeit",null,"Konzept",null,"Die Ebenen"]
[1,"Strom - Test für Strategy Map",1,{"$f":"IF(C5=\"-\",\"\",IFERROR(($D$2/COUNTIF($C$5:$C$13,\">0\")*(H5/F5)),0))","v":0},{"$f":"IF(C5=1,D5,\"-\")","v":0},{"$f":"IF(C5=\"-\",\"\",\"100%\")","v":"100%"},0.28000000000000003,{"$f":"IF($D$2=0,\"-\",IF(C5=1,G5,\"-\"))","v":"-"}]
[2,"Wasser","-","","-","",0.27,{"$f":"IF($D$2=0,\"-\",IF(C6=1,G6,\"-\"))","v":"-"}]
[3,"Gastronomie","-","","-","",0.26,{"$f":"IF($D$2=0,\"-\",IF(C7=1,G7,\"-\"))","v":"-"}]
[4,"Rasen","-","","-","",0.25,"-"]
[5,"Vereinsgelände","-","","-","",0.24,"-"]
[6,"Veranstaltungen","-",{"$f":"IF(C10=\"-\",\"\",IFERROR(($D$2/COUNTIF($C$5:$C$13,\">0\")*(H10/F10)),0))","v":""},"-",{"$f":"IF(C10=\"-\",\"\",\"100%\")","v":""},0.23,"-"]
[7,"Gebäude","-","","-",{"$f":"IF(C11=\"-\",\"\",\"100%\")","v":""},0.22,"-"]
[8,"Verwaltung","-","","-","",0.21,"-"]
[9,"Test","-",{"$f":"IF(C13=\"-\",\"\",IFERROR(($D$2/COUNTIF($C$5:$C$13,\">0\")*(H13/F13)),0))","v":""},"-","",0.2,"-"]